RESNUM,RESNAME,H_X,H_Y,H_BEST_REF_SCORE,H_BEST_REF_COV,H_BEST_REF_MATCH,H_UCBShift,HA_X,HA_Y,HA_BEST_REF_SCORE,HA_BEST_REF_COV,HA_BEST_REF_MATCH,HA_UCBShift,C_X,C_Y,C_BEST_REF_SCORE,C_BEST_REF_COV,C_BEST_REF_MATCH,C_UCBShift,CA_X,CA_Y,CA_BEST_REF_SCORE,CA_BEST_REF_COV,CA_BEST_REF_MATCH,CA_UCBShift,CB_X,CB_Y,CB_BEST_REF_SCORE,CB_BEST_REF_COV,CB_BEST_REF_MATCH,CB_UCBShift,N_X,N_Y,N_BEST_REF_SCORE,N_BEST_REF_COV,N_BEST_REF_MATCH,N_UCBShift
1,MET,8.280826142496393,,0.0,0.0,0,8.280826142496393,4.290397074586524,,0.0,0.0,0,4.290397074586524,174.67242032489733,,0.0,0.0,0,174.67242032489733,55.16613089045399,,0.0,0.0,0,55.16613089045399,32.786203546492395,,0.0,0.0,0,32.786203546492395,120.70018178175158,,0.0,0.0,0,120.70018178175158
2,PHE,8.412762347474748,,0.0,0.0,0,8.412762347474748,4.413344968298368,4.69,0.23737230611098886,0.8493150684931506,1,4.647981775657676,175.42599641630594,174.9,0.23737230611098886,0.8493150684931506,1,175.11195618217894,57.463380821761575,57.87,0.23737230611098886,0.8493150684931506,1,57.86184485994561,39.44253827645688,39.38,0.23737230611098886,0.8493150684931506,1,39.23714843956044,122.4119387502553,,0.0,0.0,0,122.4119387502553
3,ARG,8.349951977128427,8.309221955725734,0.23737230611098886,0.8493150684931506,1,8.302641008319458,4.290903149700299,4.2907780442742665,0.23737230611098886,0.8493150684931506,1,4.3195904398656895,176.05366800299146,175.28979039045117,0.23737230611098886,0.8493150684931506,1,175.42946604858477,55.82967896340326,55.58064837022855,0.23737230611098886,0.8493150684931506,1,55.83379175912976,30.984252035586636,30.9576658671772,0.23737230611098886,0.8493150684931506,1,31.014276745332445,124.050868057992,124.93,0.23737230611098886,0.8493150684931506,1,125.20930145250306
4,GLU,8.65340114125874,8.51,0.23737230611098886,0.8493150684931506,1,8.515690841713841,4.179302178396603,4.22,0.23737230611098886,0.8493150684931506,1,4.262462275485626,177.09022016368075,176.42,0.23737230611098886,0.8493150684931506,1,176.54667742667885,57.06558821874792,56.57,0.23737230611098886,0.8493150684931506,1,56.68857925959041,29.85012983225108,29.95,0.23737230611098886,0.8493150684931506,1,29.91796297074592,124.08562595508936,123.54,0.23737230611098886,0.8493150684931506,1,123.88823603926629
5,GLU,8.535630332833833,8.62,0.23737230611098886,0.8493150684931506,1,8.617279241297592,4.212373035775336,4.31,0.23737230611098886,0.8493150684931506,1,4.313560210167609,176.87117441358086,176.4,0.23737230611098886,0.8493150684931506,1,176.56094868791763,56.504010834448884,56.54,0.23737230611098886,0.8493150684931506,1,56.683736633555334,29.28919230175935,30.01,0.23737230611098886,0.8493150684931506,1,29.87569758150738,124.3941354461261,122.73,0.23737230611098886,0.8493150684931506,1,123.27463325385726
6,SER,8.279365073132423,,0.0,0.0,0,8.279365073132423,4.381905468398268,,0.0,0.0,0,4.381905468398268,174.57905413343323,,0.0,0.0,0,174.57905413343323,58.537675797330444,,0.0,0.0,0,58.537675797330444,63.26213914610945,,0.0,0.0,0,63.26213914610945,117.88597243567544,,0.0,0.0,0,117.88597243567544
7,ARG,8.142252317443667,8.389740651908578,0.23737230611098886,0.8493150684931506,1,8.357460672671774,4.288805994375069,4.460389022137133,0.23737230611098886,0.8493150684931506,1,4.453152176379176,175.97353796263738,176.1269526599258,0.23737230611098886,0.8493150684931506,1,176.3071460388223,56.466206077611275,55.670778044274265,0.23737230611098886,0.8493150684931506,1,55.96658053795094,30.682487056349206,30.820324185114277,0.23737230611098886,0.8493150684931506,1,30.981319342096793,123.30640839069264,123.63779554122291,0.23737230611098886,0.8493150684931506,1,123.74089106743257
8,SER,8.466956964296815,8.509546140840012,0.23737230611098886,0.8493150684931506,1,8.51206013009768,4.4329371970140965,4.460518696182844,0.23737230611098886,0.8493150684931506,1,4.484920798473748,174.43304499648684,173.91038902213714,0.23737230611098886,0.8493150684931506,1,174.0651987704351,58.33083073287268,58.36870325954289,0.23737230611098886,0.8493150684931506,1,58.380129091336435,63.563067177550224,63.51103739236569,0.23737230611098886,0.8493150684931506,1,63.43331224314574,118.18715941405817,118.61267341641734,0.23737230611098886,0.8493150684931506,1,118.88476366322011
9,VAL,8.128546864324564,8.033906569410144,0.23737230611098886,0.8493150684931506,1,8.047730313530913,3.658146248351649,4.163906569410144,0.23737230611098886,0.8493150684931506,1,4.081337111111112,174.6921889325397,175.65248588784866,0.23737230611098886,0.8493150684931506,1,175.60225388635808,60.18033041188811,59.058243065877896,0.23737230611098886,0.8493150684931506,1,59.24470874111444,32.222798750038855,32.34536447686329,0.23737230611098886,0.8493150684931506,1,32.155494121595076,123.13745856988012,122.46,0.23737230611098886,0.8493150684931506,1,123.04617612869907
10,PRO,,,0.0,0.0,0,,4.407592091441892,4.3611588807841795,0.23737230611098886,0.8493150684931506,1,4.374403084443334,174.99678667680098,175.29592530430952,0.23737230611098886,0.8493150684931506,1,175.5195450370907,63.5006497015651,64.00407469569046,0.23737230611098886,0.8493150684931506,1,64.09381373651348,31.89763179028194,31.9862243309785,0.23737230611098886,0.8493150684931506,1,31.98849496968032,,,0.0,0.0,0,
11,VAL,6.51886232975913,6.220859854115216,0.23737230611098886,0.8493150684931506,1,6.349993553984904,4.212198507875457,4.7866914839277825,0.23737230611098886,0.8493150684931506,1,4.671574058929958,174.04881474203574,173.1136075427412,0.23737230611098886,0.8493150684931506,1,173.54745198509823,59.550266572544125,58.137177859590686,0.23737230611098886,0.8493150684931506,1,58.30973803545344,35.74686852594072,34.92570072942392,0.23737230611098886,0.8493150684931506,1,34.9442028968032,114.50784096617272,108.54127177799477,0.23737230611098886,0.8493150684931506,1,109.26187555416806
12,GLU,8.785983321583972,7.933046715294928,0.23737230611098886,0.8493150684931506,1,8.079398188650238,4.57429835488123,4.515364476863285,0.23737230611098886,0.8493150684931506,1,4.515174455733155,176.4205664003108,174.96943917255373,0.23737230611098886,0.8493150684931506,1,175.2826929583139,54.54245449243535,53.87781313882029,0.23737230611098886,0.8493150684931506,1,53.9023847521534,31.906982253441004,33.415663503532244,0.23737230611098886,0.8493150684931506,1,33.328333918109664,123.36463786005662,119.17220608389334,0.23737230611098886,0.8493150684931506,1,119.96962386683317
13,GLU,8.5749531993007,8.85,0.23737230611098886,0.8493150684931506,1,8.85986973000888,3.9180950120990117,3.61,0.23737230611098886,0.8493150684931506,1,3.6483312457209447,177.5511876563159,177.18,0.23737230611098886,0.8493150684931506,1,177.2537500849928,58.33373445405706,58.46,0.23737230611098886,0.8493150684931506,1,58.424429637074034,29.536008358347207,29.12,0.23737230611098886,0.8493150684931506,1,29.02687596068376,121.63881580752026,122.25,0.23737230611098886,0.8493150684931506,1,122.3979262543401
14,GLY,9.117556694971695,9.25188783451075,0.23737230611098886,0.8493150684931506,1,9.211406696409146,4.00376161478244,,0.0,0.0,0,4.00376161478244,174.36653772982572,173.61914014588478,0.23737230611098886,0.8493150684931506,1,173.77394694227993,45.27716841754357,45.0137756690215,0.23737230611098886,0.8493150684931506,1,45.02272189169164,,,0.0,0.0,0,,113.45487931208791,113.30405547297684,0.23737230611098886,0.8493150684931506,1,113.65442799482739
15,GLU,7.880250967149517,7.5503113547823775,0.23737230611098886,0.8493150684931506,1,7.558221145454545,4.3604457217338215,4.321556773911891,0.23737230611098886,0.8493150684931506,1,4.3572854304306805,175.42352363544788,174.28956889337823,0.23737230611098886,0.8493150684931506,1,174.5885388625097,56.38753943922744,55.670143702207255,0.23737230611098886,0.8493150684931506,1,55.713214252824955,31.115939337234988,31.51703015438347,0.23737230611098886,0.8493150684931506,1,31.53762681982462,120.08137728080253,120.510574808829,0.23737230611098886,0.8493150684931506,1,121.01855925524475
16,VAL,8.132545043756243,7.84,0.23737230611098886,0.8493150684931506,1,7.8803230992895985,4.930058625885226,5.56,0.23737230611098886,0.8493150684931506,1,5.384724342091243,175.38688692562994,175.68,0.23737230611098886,0.8493150684931506,1,175.78117202201133,61.18639996167721,59.4,0.23737230611098886,0.8493150684931506,1,59.430307954534356,33.2784343009546,33.92,0.23737230611098886,0.8493150684931506,1,34.09903297081252,120.94860506701077,118.85,0.23737230611098886,0.8493150684931506,1,119.45112588968254
17,TYR,9.16720912211122,8.805925304309538,0.23737230611098886,0.8493150684931506,1,8.867404489133088,4.877466888300589,4.74072895372657,0.23737230611098886,0.8493150684931506,1,4.865096443767344,175.28026734834611,173.58592530430954,0.23737230611098886,0.8493150684931506,1,174.0429691467144,56.6973940037851,56.58042992705761,0.23737230611098886,0.8493150684931506,1,56.49387666784327,41.91977318140748,43.519308272165105,0.23737230611098886,0.8493150684931506,1,43.459136148179596,126.63510383097459,121.88474720081174,0.23737230611098886,0.8493150684931506,1,123.20955772172826
18,ASP,8.763582305339106,8.77964074448187,0.23737230611098886,0.8493150684931506,1,8.802133573754023,5.055668938200688,5.509233588227992,0.23737230611098886,0.8493150684931506,1,5.336731419425019,175.371154680353,175.94021555331088,0.23737230611098886,0.8493150684931506,1,176.1419401976357,54.53852755921301,54.27707805511922,0.23737230611098886,0.8493150684931506,1,54.367495115084914,40.85796474618715,41.46944914153887,0.23737230611098886,0.8493150684931506,1,41.411903744078145,123.9829398961372,123.24320934929528,0.23737230611098886,0.8493150684931506,1,123.51609009304585
19,VAL,8.875298016494616,9.063177615683571,0.23737230611098886,0.8493150684931506,1,9.058741060556109,4.615908692651792,5.013046715294927,0.23737230611098886,0.8493150684931506,1,4.934080137523588,174.2717056577367,174.4510652062872,0.23737230611098886,0.8493150684931506,1,174.55662410357422,59.821477826051726,58.66943917255375,0.23737230611098886,0.8493150684931506,1,58.587360320129875,35.34422923906094,36.31728953726571,0.23737230611098886,0.8493150684931506,1,36.42768256714952,119.42557362407038,116.29745888308159,0.23737230611098886,0.8493150684931506,1,117.02450781355311
20,THR,8.336202095732046,8.142747688625965,0.23737230611098886,0.8493150684931506,1,8.17411929886225,5.060098707620158,5.331457907453141,0.23737230611098886,0.8493150684931506,1,5.257489561038961,174.22498540168718,174.56099075450385,0.23737230611098886,0.8493150684931506,1,174.69051718132422,61.73927348853923,60.72665425803611,0.23737230611098886,0.8493150684931506,1,60.856252805389055,69.66875421198802,70.12291581490628,0.23737230611098886,0.8493150684931506,1,70.02896586851482,118.42721088720724,116.54758856393467,0.23737230611098886,0.8493150684931506,1,117.15512119290153
21,ILE,9.280843036452437,9.008411192158214,0.23737230611098886,0.8493150684931506,1,9.038234132412033,4.1003950435120435,4.0881121654892505,0.23737230611098886,0.8493150684931506,1,4.0939913882894885,175.13417764496614,177.1406352792296,0.23737230611098886,0.8493150684931506,1,176.86361500536685,60.580791181285385,59.128448418049885,0.23737230611098886,0.8493150684931506,1,59.287123086119436,36.11401854841825,33.783644768632854,0.23737230611098886,0.8493150684931506,1,34.116461118315016,126.81319087379843,127.70093430589857,0.23737230611098886,0.8493150684931506,1,127.92749693116329
22,GLN,8.843637575291377,9.097990052291479,0.23737230611098886,0.8493150684931506,1,9.087765683344434,4.388857111843712,4.578508748474324,0.23737230611098886,0.8493150684931506,1,4.571092881335331,176.08428917975357,174.37902744465717,0.23737230611098886,0.8493150684931506,1,174.80706226915308,55.934559972999224,56.47435917901157,0.23737230611098886,0.8493150684931506,1,56.478583730491735,29.817928878410477,31.896174615651525,0.23737230611098886,0.8493150684931506,1,31.674762464124765,127.73189863019758,128.32862332403977,0.23737230611098886,0.8493150684931506,1,128.56841011446886
23,ASP,7.743357237407038,7.962747688625965,0.23737230611098886,0.8493150684931506,1,7.970131517782218,4.812146104112554,4.86,0.23737230611098886,0.8493150684931506,1,4.884486546403596,174.32941606393607,172.55403746979877,0.23737230611098886,0.8493150684931506,1,172.90656066419692,53.626512483272286,52.50943917255375,0.23737230611098886,0.8493150684931506,1,52.68428716582307,43.87104329058719,44.622654014129,0.23737230611098886,0.8493150684931506,1,44.70744841648352,118.12439346485182,118.25626155687017,0.23737230611098886,0.8493150684931506,1,118.36426491169387
24,ILE,8.684140550222,8.978443911451468,0.23737230611098886,0.8493150684931506,1,8.933497330846931,4.766814078948829,4.746354028239839,0.23737230611098886,0.8493150684931506,1,4.757189371028971,175.9865321437396,175.46797495381122,0.23737230611098886,0.8493150684931506,1,175.54713331785993,59.860658697064046,58.32473310266845,0.23737230611098886,0.8493150684931506,1,58.27883922004662,40.61040951313131,39.24,0.23737230611098886,0.8493150684931506,1,39.4886439958597,121.24214169817405,120.36247890534877,0.23737230611098886,0.8493150684931506,1,121.02430710602177
25,ALA,9.032030654362305,9.28,0.23737230611098886,0.8493150684931506,1,9.251640153013653,4.346882510658786,4.47,0.23737230611098886,0.8493150684931506,1,4.482747320496171,179.1193831311633,178.96,0.23737230611098886,0.8493150684931506,1,178.92416840447888,52.28048001653347,51.15,0.23737230611098886,0.8493150684931506,1,51.21975981107226,20.201188860073263,20.77,0.23737230611098886,0.8493150684931506,1,20.68048098554779,131.15874776143855,129.7,0.23737230611098886,0.8493150684931506,1,130.1187613511322
26,ARG,8.774848797385948,8.73,0.19640736769937617,0.47058823529411764,0,8.690198830885782,4.09723920471473,4.0520099477085205,0.23737230611098886,0.8493150684931506,1,4.051348432978132,177.00448591325343,177.7305835332057,0.23737230611098886,0.8493150684931506,1,177.79332941304253,58.3875249980242,59.18768096565746,0.23737230611098886,0.8493150684931506,1,59.07974656459096,29.913798514990564,29.53,0.23737230611098886,0.8493150684931506,1,29.591648488017537,121.87979123711844,123.39,0.19640736769937617,0.47058823529411764,0,122.68756678585304
27,GLN,8.213097274836276,8.18,0.23737230611098886,0.8493150684931506,1,8.1557469000222,4.381562096964147,4.47,0.23737230611098886,0.8493150684931506,1,4.430096037573538,176.65045716654456,176.52,0.23737230611098886,0.8493150684931506,1,176.4622225359363,55.58143302827728,55.56,0.23737230611098886,0.8493150684931506,1,55.62501826813187,28.817315105810856,26.75,0.23737230611098886,0.8493150684931506,1,27.301852706654458,117.59211975925186,113.77,0.23737230611098886,0.8493150684931506,1,114.45197552328781
28,GLY,8.198306961788212,7.864766423525359,0.23737230611098886,0.8493150684931506,1,7.899635343212344,3.9771915293234548,,0.0,0.0,0,3.9771915293234548,173.60932066671663,174.17871021882718,0.23737230611098886,0.8493150684931506,1,174.3253338330392,45.256739294316795,45.107981265100605,0.23737230611098886,0.8493150684931506,1,45.08103696783217,,,0.0,0.0,0,,108.82634073675769,107.52420559607911,0.23737230611098886,0.8493150684931506,1,108.11179396793206
29,ASP,8.08241377942613,7.445925304309538,0.23737230611098886,0.8493150684931506,1,7.457258755033855,4.870293735425685,4.68738321176268,0.23737230611098886,0.8493150684931506,1,4.7248725177378175,175.6821493332723,175.03429927057607,0.23737230611098886,0.8493150684931506,1,175.10900759125875,54.089454222394274,54.80745766354603,0.23737230611098886,0.8493150684931506,1,54.723439249766905,41.34612249667,41.6,0.23737230611098886,0.8493150684931506,1,41.58531790581641,120.59614177010212,120.84527080236631,0.23737230611098886,0.8493150684931506,1,121.1951533853147
30,GLY,9.577947639443892,7.879925548216652,0.23737230611098886,0.8493150684931506,1,8.11660573991564,4.028768621167721,,0.0,0.0,0,4.028768621167721,172.27372931303142,172.50510267608598,0.23737230611098886,0.8493150684931506,1,172.50532491685536,45.8454613535187,45.30897201960447,0.23737230611098886,0.8493150684931506,1,45.367402445343544,,,0.0,0.0,0,,111.8690833917527,109.67065450194322,0.23737230611098886,0.8493150684931506,1,110.32492159114774
31,ILE,8.805838622782773,8.49,0.23737230611098886,0.8493150684931506,1,8.564412447474748,4.5923383755078255,4.816093430589857,0.23737230611098886,0.8493150684931506,1,4.83776389919525,175.28738351506826,174.68248588784866,0.23737230611098886,0.8493150684931506,1,174.82759641527363,60.56608857827728,60.645495377251926,0.23737230611098886,0.8493150684931506,1,60.57894187664003,39.02344518295593,40.95351386824421,0.23737230611098886,0.8493150684931506,1,40.772080828743476,123.36810887064048,121.00026180077728,0.23737230611098886,0.8493150684931506,1,121.46563502929293
32,ALA,8.987024221756021,9.229570072942392,0.23737230611098886,0.8493150684931506,1,9.23747328019203,4.7359805452880455,4.84738321176268,0.23737230611098886,0.8493150684931506,1,4.862871461510712,175.53488529236319,174.80738321176267,0.23737230611098886,0.8493150684931506,1,174.89023066709402,50.714555595127095,49.03072895372657,0.23737230611098886,0.8493150684931506,1,49.17299984271839,21.77944065515596,22.127046959202044,0.23737230611098886,0.8493150684931506,1,21.978679075396826,131.8350484598457,130.88596253020123,0.23737230611098886,0.8493150684931506,1,131.14895099527695
33,ARG,8.452767730735932,8.738972019604466,0.23737230611098886,0.8493150684931506,1,8.755849722233323,5.081020380985681,5.370299026668963,0.23737230611098886,0.8493150684931506,1,5.33296747964258,175.29650456481298,176.10970097333103,0.23737230611098886,0.8493150684931506,1,176.0485200820624,55.111516647402595,54.4520187348994,0.23737230611098886,0.8493150684931506,1,54.6398547516317,32.430561474170275,34.59585085252619,0.23737230611098886,0.8493150684931506,1,34.48251201281496,121.36206396007326,117.3731403897919,0.23737230611098886,0.8493150684931506,1,117.98580027030192
34,ILE,8.819282721928072,8.258672992935503,0.23737230611098886,0.8493150684931506,1,8.371048111915862,4.418576178737928,4.134635523136715,0.23737230611098886,0.8493150684931506,1,4.2053735321511825,176.50344993328338,174.9866542580361,0.23737230611098886,0.8493150684931506,1,175.27174733129092,60.27847485891331,60.365794403920894,0.23737230611098886,0.8493150684931506,1,60.332419127183925,39.878549004073705,39.83857931843853,0.23737230611098886,0.8493150684931506,1,40.05583602648463,125.54035611621713,123.22609343058986,0.23737230611098886,0.8493150684931506,1,123.72766754276834
35,GLU,9.4477607491009,9.38987032595429,0.23737230611098886,0.8493150684931506,1,9.387602834382283,3.9776079311244317,3.8523989698456536,0.23737230611098886,0.8493150684931506,1,3.8746910897546902,175.92553392926516,176.66688782290294,0.23737230611098886,0.8493150684931506,1,176.7789470738761,57.19962816208236,56.643371525188485,0.23737230611098886,0.8493150684931506,1,56.665909466688866,28.556921367027414,27.2,0.23737230611098886,0.8493150684931506,1,27.511445778465983,128.41565448589745,126.4493365312912,0.23737230611098886,0.8493150684931506,1,127.12728110989566
36,GLY,8.595094391036742,8.45188783451075,0.23737230611098886,0.8493150684931506,1,8.495698275879676,3.8665991461510703,,0.0,0.0,0,3.8665991461510703,174.37620928184037,172.32390656941016,0.23737230611098886,0.8493150684931506,1,172.67106108699633,45.422676558286156,45.2542055960791,0.23737230611098886,0.8493150684931506,1,45.210684227550225,,,0.0,0.0,0,,104.0698975545177,103.96831751766125,0.23737230611098886,0.8493150684931506,1,104.07015243387168
37,PHE,8.30121287780553,8.32,0.23737230611098886,0.8493150684931506,1,8.343237135675436,4.555252954467754,4.555794403920893,0.23737230611098886,0.8493150684931506,1,4.567122502985903,174.64629678930515,174.4944673968564,0.23737230611098886,0.8493150684931506,1,174.6454674327284,58.14262252238873,57.58407469569046,0.23737230611098886,0.8493150684931506,1,57.68479429178599,39.905603862271064,41.376523357647464,0.23737230611098886,0.8493150684931506,1,41.22898888622489,124.1151310395771,127.08964452472574,0.23737230611098886,0.8493150684931506,1,126.51920748125208
38,VAL,7.946947113680763,7.599271046273429,0.23737230611098886,0.8493150684931506,1,7.667162728166278,4.349134454478854,3.582448661957002,0.23737230611098886,0.8493150684931506,1,3.8860204179209674,174.95657040296928,172.87026180077729,0.23737230611098886,0.8493150684931506,1,173.200071343784,61.84435462885448,64.12755133804299,0.23737230611098886,0.8493150684931506,1,63.67403645939616,32.084998865184815,32.42566350353225,0.23737230611098886,0.8493150684931506,1,32.23209216642802,126.7047682995338,128.83540170275495,0.23737230611098886,0.8493150684931506,1,128.8388973390332
39,ILE,8.997405081895883,8.635980362251946,0.23737230611098886,0.8493150684931506,1,8.709406184704184,4.763304056648907,4.315301532604379,0.23737230611098886,0.8493150684931506,1,4.449478538622489,174.57526902138417,174.723318383799,0.23737230611098886,0.8493150684931506,1,174.79857072004663,59.548008033366635,58.351500696638354,0.23737230611098886,0.8493150684931506,1,58.37800961318681,41.11685294706405,40.00828050157961,0.23737230611098886,0.8493150684931506,1,40.1404742531413,127.57706027529692,126.18290320453643,0.23737230611098886,0.8493150684931506,1,126.64765360387945
40,PHE,9.11850504995005,8.828411192158214,0.23737230611098886,0.8493150684931506,1,8.905153245548895,5.295356562887113,5.3611588807841795,0.23737230611098886,0.8493150684931506,1,5.305569760894661,175.48740574474417,176.37652335764747,0.23737230611098886,0.8493150684931506,1,176.34772612962038,57.057202724586524,56.46128978117282,0.23737230611098886,0.8493150684931506,1,56.55199550436785,40.290290572222226,40.16820583998622,0.23737230611098886,0.8493150684931506,1,40.31844572977578,125.39387251924187,125.8230839411866,0.23737230611098886,0.8493150684931506,1,126.09964827970917
41,VAL,9.155925498107448,9.530598053337927,0.23737230611098886,0.8493150684931506,1,9.479377997397048,5.265726240481742,4.9178131388202875,0.23737230611098886,0.8493150684931506,1,4.980570946370297,174.22128613446,173.99871021882717,0.23737230611098886,0.8493150684931506,1,174.16896810755912,58.06510737413697,58.47235498746003,0.23737230611098886,0.8493150684931506,1,58.48760946724941,33.8663738529193,32.20757056075662,0.23737230611098886,0.8493150684931506,1,32.390550143573094,125.55956337003552,122.53,0.23737230611098886,0.8493150684931506,1,122.90833847989234
42,PRO,,,0.0,0.0,0,,4.577205564541015,4.646953284705072,0.23737230611098886,0.8493150684931506,1,4.652488932101233,177.15934983185704,177.21523357647465,0.23737230611098886,0.8493150684931506,1,177.31549484757466,63.236011542834945,63.69973819922271,0.23737230611098886,0.8493150684931506,1,63.51318747307692,32.671818111655014,32.60218686117972,0.23737230611098886,0.8493150684931506,1,32.603189090698194,,,0.0,0.0,0,
43,GLY,8.59153769963925,8.83,0.23737230611098886,0.8493150684931506,1,8.838770288050839,4.009281380952381,,0.0,0.0,0,4.009281380952381,174.29359079547675,174.85,0.23737230611098886,0.8493150684931506,1,174.91260514703075,45.53978348494284,46.2,0.23737230611098886,0.8493150684931506,1,46.012960474020424,,,0.0,0.0,0,,109.85450952180042,109.75,0.23737230611098886,0.8493150684931506,1,109.94010511092796
44,THR,7.544884641508492,7.5,0.23737230611098886,0.8493150684931506,1,7.5124671604895115,4.712387455039405,4.71,0.23737230611098886,0.8493150684931506,1,4.708210298429348,172.80687867345432,173.15,0.23737230611098886,0.8493150684931506,1,173.32715980426238,60.811319865478964,59.65,0.23737230611098886,0.8493150684931506,1,59.817081448817845,71.0517002022644,73.02,0.23737230611098886,0.8493150684931506,1,72.88187687476412,110.3805927561716,107.55,0.23737230611098886,0.8493150684931506,1,108.07184942026306