RESNUM,RESNAME,H_X,H_Y,H_BEST_REF_SCORE,H_BEST_REF_COV,H_BEST_REF_MATCH,H_UCBShift,HA_X,HA_Y,HA_BEST_REF_SCORE,HA_BEST_REF_COV,HA_BEST_REF_MATCH,HA_UCBShift,C_X,C_Y,C_BEST_REF_SCORE,C_BEST_REF_COV,C_BEST_REF_MATCH,C_UCBShift,CA_X,CA_Y,CA_BEST_REF_SCORE,CA_BEST_REF_COV,CA_BEST_REF_MATCH,CA_UCBShift,CB_X,CB_Y,CB_BEST_REF_SCORE,CB_BEST_REF_COV,CB_BEST_REF_MATCH,CB_UCBShift,N_X,N_Y,N_BEST_REF_SCORE,N_BEST_REF_COV,N_BEST_REF_MATCH,N_UCBShift
1,GLY,8.395920602491952,,0,0,0,8.395920602491952,3.8281850308663556,,0,0,0,3.8281850308663556,173.36045881568987,,0,0,0,173.36045881568987,44.97651889039294,,0,0,0,44.97651889039294,,,0,0,0,,109.98016874817404,,0,0,0,109.98016874817404
2,HIS,8.45624779092574,,0,0,0,8.45624779092574,4.551343515773116,,0,0,0,4.551343515773116,174.3080574043179,,0,0,0,174.3080574043179,54.9247801999889,,0,0,0,54.9247801999889,29.270220317316017,,0,0,0,29.270220317316017,120.19186061341992,,0,0,0,120.19186061341992
3,HIS,8.229111268786768,,0,0,0,8.229111268786768,4.672785727056277,,0,0,0,4.672785727056277,174.66774979714728,,0,0,0,174.66774979714728,55.34965564111999,,0,0,0,55.34965564111999,28.8310653470252,,0,0,0,28.8310653470252,121.20017146072261,,0,0,0,121.20017146072261
4,HIS,8.228035642063492,,0,0,0,8.228035642063492,4.398495058896659,,0,0,0,4.398495058896659,174.60735864449995,,0,0,0,174.60735864449995,55.87236154744145,,0,0,0,55.87236154744145,28.741267718709068,,0,0,0,28.741267718709068,121.96056680179265,,0,0,0,121.96056680179265
5,HIS,8.25834667025197,,0,0,0,8.25834667025197,4.40067307992563,,0,0,0,4.40067307992563,174.6304032203574,,0,0,0,174.6304032203574,55.84471372136752,,0,0,0,55.84471372136752,28.944798244222444,,0,0,0,28.944798244222444,121.92465772985904,,0,0,0,121.92465772985904
6,HIS,8.297732072422022,,0,0,0,8.297732072422022,4.326260088400488,,0,0,0,4.326260088400488,174.6521453311078,,0,0,0,174.6521453311078,56.32334383589744,,0,0,0,56.32334383589744,29.257273727849928,,0,0,0,29.257273727849928,121.70307881580086,,0,0,0,121.70307881580086
7,HIS,8.362951918670218,,0,0,0,8.362951918670218,4.242072693184594,,0,0,0,4.242072693184594,175.0603531519869,,0,0,0,175.0603531519869,56.92753956450216,,0,0,0,56.92753956450216,30.170975953574203,,0,0,0,30.170975953574203,121.91287142590743,,0,0,0,121.91287142590743
8,LEU,8.386155833344434,,0,0,0,8.386155833344434,4.2027083528332785,,0,0,0,4.2027083528332785,177.10776753893327,,0,0,0,177.10776753893327,54.89827787104562,,0,0,0,54.89827787104562,41.555161479609275,,0,0,0,41.555161479609275,126.64380185241426,,0,0,0,126.64380185241426
9,GLU,8.281472143894995,,0,0,0,8.281472143894995,4.200493128654678,,0,0,0,4.200493128654678,176.42959853095792,,0,0,0,176.42959853095792,56.46455684488289,,0,0,0,56.46455684488289,28.72390074055944,,0,0,0,28.72390074055944,122.71773874062605,,0,0,0,122.71773874062605
10,CYS,8.19913609009324,,0,0,0,8.19913609009324,4.284430318087468,,0,0,0,4.284430318087468,174.3887963071151,,0,0,0,174.3887963071151,58.769157734304585,,0,0,0,58.769157734304585,26.721377545748695,,0,0,0,26.721377545748695,123.48040772729492,,0,0,0,123.48040772729492
11,SER,8.14026741899767,,0,0,0,8.14026741899767,4.417067747580197,,0,0,0,4.417067747580197,174.8468139037518,,0,0,0,174.8468139037518,58.94748174234654,,0,0,0,58.94748174234654,63.699024391580636,,0,0,0,63.699024391580636,119.15359237216673,,0,0,0,119.15359237216673
12,SER,8.541479437096237,,0,0,0,8.541479437096237,4.40913098983239,,0,0,0,4.40913098983239,174.15561313114108,,0,0,0,174.15561313114108,57.947096324297924,,0,0,0,57.947096324297924,62.93733481708846,,0,0,0,62.93733481708846,118.98254484800755,,0,0,0,118.98254484800755
13,ASP,8.25060818904429,,0,0,0,8.25060818904429,4.648032247752248,,0,0,0,4.648032247752248,176.0063366662671,,0,0,0,176.0063366662671,54.63275220026085,,0,0,0,54.63275220026085,41.112794303108004,,0,0,0,41.112794303108004,122.85652865783106,,0,0,0,122.85652865783106
14,SER,8.331642046553448,,0,0,0,8.331642046553448,4.40134858986014,,0,0,0,4.40134858986014,175.18364838848927,,0,0,0,175.18364838848927,58.03939961828726,,0,0,0,58.03939961828726,63.76794513120768,,0,0,0,63.76794513120768,117.94133144163614,,0,0,0,117.94133144163614
15,LEU,8.440185922965924,,0,0,0,8.440185922965924,4.23655947009102,,0,0,0,4.23655947009102,177.16636432966476,,0,0,0,177.16636432966476,55.327886041674994,,0,0,0,55.327886041674994,41.83437036405817,,0,0,0,41.83437036405817,125.24511287342102,,0,0,0,125.24511287342102
16,GLN,8.278504124869576,,0,0,0,8.278504124869576,4.2178685256077255,,0,0,0,4.2178685256077255,175.06191197385948,,0,0,0,175.06191197385948,55.502502436002885,,0,0,0,55.502502436002885,28.805346745798644,,0,0,0,28.805346745798644,121.620281564763,,0,0,0,121.620281564763
17,LEU,8.104553914313465,,0,0,0,8.104553914313465,4.463528576645577,,0,0,0,4.463528576645577,176.87369726316462,,0,0,0,176.87369726316462,54.797272110805864,,0,0,0,54.797272110805864,42.49416131064491,,0,0,0,42.49416131064491,125.6144960952603,,0,0,0,125.6144960952603
18,HIS,8.844867425457876,,0,0,0,8.844867425457876,4.866370764513265,,0,0,0,4.866370764513265,174.3464471563603,,0,0,0,174.3464471563603,54.64111466444666,,0,0,0,54.64111466444666,32.43298759629815,,0,0,0,32.43298759629815,121.04234928385503,,0,0,0,121.04234928385503
19,ASN,8.975089982367633,,0,0,0,8.975089982367633,5.541012794128093,,0,0,0,5.541012794128093,174.66010636988565,,0,0,0,174.66010636988565,52.36381566187701,,0,0,0,52.36381566187701,40.51165687844378,,0,0,0,40.51165687844378,120.56981793573648,,0,0,0,120.56981793573648
20,VAL,9.031677056410256,,0,0,0,9.031677056410256,4.8688476013264514,,0,0,0,4.8688476013264514,174.52875115243646,,0,0,0,174.52875115243646,60.410861114002664,,0,0,0,60.410861114002664,33.648560343462094,,0,0,0,33.648560343462094,124.67492691238206,,0,0,0,124.67492691238206
21,PHE,9.483781069746922,,0,0,0,9.483781069746922,5.284546498429349,,0,0,0,5.284546498429349,173.73812268852814,,0,0,0,173.73812268852814,56.70053869366745,,0,0,0,56.70053869366745,40.53273812942613,,0,0,0,40.53273812942613,128.83370538413254,,0,0,0,128.83370538413254
22,VAL,8.656748253185702,,0,0,0,8.656748253185702,4.291616842762792,,0,0,0,4.291616842762792,174.85302445941838,,0,0,0,174.85302445941838,60.8633957967255,,0,0,0,60.8633957967255,33.285013524048175,,0,0,0,33.285013524048175,126.51611743669665,,0,0,0,126.51611743669665
23,TYR,7.582667257642357,,0,0,0,7.582667257642357,4.468570018126318,,0,0,0,4.468570018126318,174.22815527844378,,0,0,0,174.22815527844378,56.4449472529748,,0,0,0,56.4449472529748,40.656348494844046,,0,0,0,40.656348494844046,120.12265498928849,,0,0,0,120.12265498928849
24,GLY,6.582021352491954,,0,0,0,6.582021352491954,3.6574965093906093,,0,0,0,3.6574965093906093,174.60287988306138,,0,0,0,174.60287988306138,44.31635221265957,,0,0,0,44.31635221265957,,,0,0,0,,109.256425559657,,0,0,0,109.256425559657
25,SER,8.04979493901654,,0,0,0,8.04979493901654,3.6011866524392278,,0,0,0,3.6011866524392278,175.65398208428238,,0,0,0,175.65398208428238,60.37906860026639,,0,0,0,60.37906860026639,62.15062864309024,,0,0,0,62.15062864309024,119.1947658418859,,0,0,0,119.1947658418859
26,PHE,6.791277374136973,,0,0,0,6.791277374136973,4.502949606138306,,0,0,0,4.502949606138306,176.20064900447886,,0,0,0,176.20064900447886,58.79484370840826,,0,0,0,58.79484370840826,37.595764435614385,,0,0,0,37.595764435614385,116.79664468411588,,0,0,0,116.79664468411588
27,GLN,7.291449412759464,,0,0,0,7.291449412759464,3.8990641915750914,,0,0,0,3.8990641915750914,175.58199314005438,,0,0,0,175.58199314005438,57.198968086896436,,0,0,0,57.198968086896436,29.026278245343544,,0,0,0,29.026278245343544,116.11754539601509,,0,0,0,116.11754539601509
28,ASP,7.814046443295593,,0,0,0,7.814046443295593,5.0863457060051065,,0,0,0,5.0863457060051065,175.51777289659785,,0,0,0,175.51777289659785,52.53867126771562,,0,0,0,52.53867126771562,43.31075332921523,,0,0,0,43.31075332921523,121.40598845470086,,0,0,0,121.40598845470086
29,PRO,,,0,0,0,,4.215104703690754,,0,0,0,4.215104703690754,178.7751981589022,,0,0,0,178.7751981589022,64.91313423441004,,0,0,0,64.91313423441004,32.310509229703634,,0,0,0,32.310509229703634,,,0,0,0,
30,ASP,8.101380800671551,,0,0,0,8.101380800671551,4.510659289543789,,0,0,0,4.510659289543789,178.9358411865579,,0,0,0,178.9358411865579,57.372321467182815,,0,0,0,57.372321467182815,40.407672530636034,,0,0,0,40.407672530636034,119.20238980760907,,0,0,0,119.20238980760907
31,VAL,7.792724572544122,,0,0,0,7.792724572544122,3.8169947364385615,,0,0,0,3.8169947364385615,177.85802500973472,,0,0,0,177.85802500973472,66.45807367609058,,0,0,0,66.45807367609058,31.449337796880897,,0,0,0,31.449337796880897,121.11337641367521,,0,0,0,121.11337641367521
32,ILE,8.251196807104007,,0,0,0,8.251196807104007,3.6144382967476973,,0,0,0,3.6144382967476973,177.60405130885226,,0,0,0,177.60405130885226,64.40371512177268,,0,0,0,64.40371512177268,35.88629336309801,,0,0,0,35.88629336309801,119.9501178419192,,0,0,0,119.9501178419192
33,ASN,8.476074026112776,,0,0,0,8.476074026112776,4.572427924159174,,0,0,0,4.572427924159174,177.7677348905983,,0,0,0,177.7677348905983,56.52380659841825,,0,0,0,56.52380659841825,38.83681396156621,,0,0,0,38.83681396156621,119.12212370587746,,0,0,0,119.12212370587746
34,VAL,8.204256539882339,,0,0,0,8.204256539882339,3.668506633713508,,0,0,0,3.668506633713508,178.32822331385282,,0,0,0,178.32822331385282,66.31965267325452,,0,0,0,66.31965267325452,31.638379767521368,,0,0,0,31.638379767521368,120.29311673010324,,0,0,0,120.29311673010324
35,MET,8.226310838300588,,0,0,0,8.226310838300588,4.088882669655344,,0,0,0,4.088882669655344,177.33385965737043,,0,0,0,177.33385965737043,58.94881981870352,,0,0,0,58.94881981870352,33.47292808148518,,0,0,0,33.47292808148518,119.38701971882006,,0,0,0,119.38701971882006
36,LEU,8.25025858995449,,0,0,0,8.25025858995449,4.258147763958264,,0,0,0,4.258147763958264,177.90100597830502,,0,0,0,177.90100597830502,55.0795681019647,,0,0,0,55.0795681019647,42.568000633677435,,0,0,0,42.568000633677435,115.22997507216118,,0,0,0,115.22997507216118
37,ASP,7.895110759068709,,0,0,0,7.895110759068709,4.4657402394771895,,0,0,0,4.4657402394771895,175.21218304025976,,0,0,0,175.21218304025976,55.602050821850376,,0,0,0,55.602050821850376,40.01157967962038,,0,0,0,40.01157967962038,118.4005674443834,,0,0,0,118.4005674443834
38,ARG,7.610993354184704,,0,0,0,7.610993354184704,4.4913084096070595,,0,0,0,4.4913084096070595,173.91032198472638,,0,0,0,173.91032198472638,55.05545872015762,,0,0,0,55.05545872015762,32.043867464729715,,0,0,0,32.043867464729715,117.25034922730603,,0,0,0,117.25034922730603
39,THR,8.422423985048285,,0,0,0,8.422423985048285,4.541528017615718,,0,0,0,4.541528017615718,173.31246683817847,,0,0,0,173.31246683817847,59.83722127319902,,0,0,0,59.83722127319902,69.82094173247863,,0,0,0,69.82094173247863,116.82399343382174,,0,0,0,116.82399343382174
40,PRO,,,0,0,0,,4.540275903521478,,0,0,0,4.540275903521478,175.75668537604062,,0,0,0,175.75668537604062,62.53655726108336,,0,0,0,62.53655726108336,33.00516111895882,,0,0,0,33.00516111895882,,,0,0,0,
41,GLU,8.337824315850815,,0,0,0,8.337824315850815,4.321292573548673,,0,0,0,4.321292573548673,175.25998174329004,,0,0,0,175.25998174329004,56.72414461048951,,0,0,0,56.72414461048951,31.03581674204684,,0,0,0,31.03581674204684,119.0679544554834,,0,0,0,119.0679544554834
42,ILE,8.596243503785104,,0,0,0,8.596243503785104,4.931465876601177,,0,0,0,4.931465876601177,175.91510621914196,,0,0,0,175.91510621914196,60.20661376430237,,0,0,0,60.20661376430237,39.065038787329335,,0,0,0,39.065038787329335,126.04643413698524,,0,0,0,126.04643413698524
43,VAL,9.352777804739704,,0,0,0,9.352777804739704,4.542798667071817,,0,0,0,4.542798667071817,175.09986656259852,,0,0,0,175.09986656259852,60.28419819004884,,0,0,0,60.28419819004884,34.76139738392163,,0,0,0,34.76139738392163,127.74197388284495,,0,0,0,127.74197388284495
44,SER,8.769575796614497,,0,0,0,8.769575796614497,4.948736156587858,,0,0,0,4.948736156587858,174.22080832652347,,0,0,0,174.22080832652347,58.50884482534687,,0,0,0,58.50884482534687,63.6803837530636,,0,0,0,63.6803837530636,121.53128172986459,,0,0,0,121.53128172986459
45,ALA,9.069551116178268,,0,0,0,9.069551116178268,5.126785539088689,,0,0,0,5.126785539088689,175.54979720883006,,0,0,0,175.54979720883006,51.52311913129093,,0,0,0,51.52311913129093,23.519710095732044,,0,0,0,23.519710095732044,125.61589139910645,,0,0,0,125.61589139910645
46,THR,8.868501445804197,,0,0,0,8.868501445804197,5.040314515445665,,0,0,0,5.040314515445665,173.00531904223553,,0,0,0,173.00531904223553,61.73981840723165,,0,0,0,61.73981840723165,70.52978837562992,,0,0,0,70.52978837562992,115.93722944640359,,0,0,0,115.93722944640359
47,LEU,8.968833511327562,,0,0,0,8.968833511327562,4.672691366633367,,0,0,0,4.672691366633367,173.06507261859807,,0,0,0,173.06507261859807,51.16284742458652,,0,0,0,51.16284742458652,42.72257090504496,,0,0,0,42.72257090504496,129.01341931678323,,0,0,0,129.01341931678323
48,PRO,,,0,0,0,,4.57367346935287,,0,0,0,4.57367346935287,176.30420070090466,,0,0,0,176.30420070090466,62.523363085125986,,0,0,0,62.523363085125986,32.64524435300255,,0,0,0,32.64524435300255,,,0,0,0,
49,GLY,8.778199581313132,,0,0,0,8.778199581313132,3.9149462426434685,,0,0,0,3.9149462426434685,173.83950122067932,,0,0,0,173.83950122067932,45.45952416769342,,0,0,0,45.45952416769342,,,0,0,0,,108.37380574952824,,0,0,0,108.37380574952824
50,PHE,8.077100031113332,,0,0,0,8.077100031113332,5.146074338672439,,0,0,0,5.146074338672439,174.4179589798757,,0,0,0,174.4179589798757,56.86239355249195,,0,0,0,56.86239355249195,43.92049383237318,,0,0,0,43.92049383237318,117.67463099674215,,0,0,0,117.67463099674215
51,GLN,9.277801174153623,,0,0,0,9.277801174153623,4.603264274558774,,0,0,0,4.603264274558774,173.93651212267176,,0,0,0,173.93651212267176,53.80224762380953,,0,0,0,53.80224762380953,32.53027999222999,,0,0,0,32.53027999222999,121.31477105898546,,0,0,0,121.31477105898546
52,ARG,8.47160277959818,,0,0,0,8.47160277959818,4.9964121762071265,,0,0,0,4.9964121762071265,175.22981559290156,,0,0,0,175.22981559290156,55.32330353468753,,0,0,0,55.32330353468753,31.739253596042843,,0,0,0,31.739253596042843,126.84528371847597,,0,0,0,126.84528371847597
53,PHE,9.316793914330114,,0,0,0,9.316793914330114,5.0915378940725935,,0,0,0,5.0915378940725935,174.6914544503885,,0,0,0,174.6914544503885,56.47166453200688,,0,0,0,56.47166453200688,42.93026247913753,,0,0,0,42.93026247913753,124.72391762910978,,0,0,0,124.72391762910978
54,ARG,8.683821790820291,,0,0,0,8.683821790820291,4.734166163431014,,0,0,0,4.734166163431014,174.57557809020426,,0,0,0,174.57557809020426,55.63072600644911,,0,0,0,55.63072600644911,32.131391106598954,,0,0,0,32.131391106598954,122.44698788517039,,0,0,0,122.44698788517039
55,LEU,8.487655412254412,,0,0,0,8.487655412254412,5.013991991158841,,0,0,0,5.013991991158841,177.25201364383395,,0,0,0,177.25201364383395,53.21351812393163,,0,0,0,53.21351812393163,43.37430399012654,,0,0,0,43.37430399012654,125.65461193722389,,0,0,0,125.65461193722389
56,LYS,9.038199104062604,,0,0,0,9.038199104062604,4.087808062851038,,0,0,0,4.087808062851038,177.60493331330892,,0,0,0,177.60493331330892,57.827406579287384,,0,0,0,57.827406579287384,32.04930843625264,,0,0,0,32.04930843625264,123.13116642437562,,0,0,0,123.13116642437562
57,GLY,8.922560531984683,,0,0,0,8.922560531984683,3.962481138697414,,0,0,0,3.962481138697414,173.71176910850815,,0,0,0,173.71176910850815,45.527548035153735,,0,0,0,45.527548035153735,,,0,0,0,,112.35984265758131,,0,0,0,112.35984265758131
58,ARG,7.72169877942058,,0,0,0,7.72169877942058,4.632608272804973,,0,0,0,4.632608272804973,175.79674226708292,,0,0,0,175.79674226708292,54.731527568503715,,0,0,0,54.731527568503715,32.11399224282384,,0,0,0,32.11399224282384,119.87263027070152,,0,0,0,119.87263027070152
59,LEU,8.571096712837164,,0,0,0,8.571096712837164,4.5673630394938405,,0,0,0,4.5673630394938405,175.35740792328227,,0,0,0,175.35740792328227,55.30386717875458,,0,0,0,55.30386717875458,41.80235034897325,,0,0,0,41.80235034897325,122.46262452873793,,0,0,0,122.46262452873793
60,TYR,6.620241255106005,,0,0,0,6.620241255106005,4.332365675435675,,0,0,0,4.332365675435675,172.15286578951606,,0,0,0,172.15286578951606,54.927889171273165,,0,0,0,54.927889171273165,39.91509989732489,,0,0,0,39.91509989732489,114.40167904393384,,0,0,0,114.40167904393384
61,PRO,,,0,0,0,,4.581939605461206,,0,0,0,4.581939605461206,175.85262841212122,,0,0,0,175.85262841212122,61.84757339595959,,0,0,0,61.84757339595959,32.58956703612499,,0,0,0,32.58956703612499,,,0,0,0,
62,CYS,8.817659004356754,,0,0,0,8.817659004356754,5.189898159429459,,0,0,0,5.189898159429459,173.3749417546176,,0,0,0,173.3749417546176,56.839210588961045,,0,0,0,56.839210588961045,30.768456107803306,,0,0,0,30.768456107803306,115.32415063836719,,0,0,0,115.32415063836719
63,ILE,8.341961118514819,,0,0,0,8.341961118514819,5.361660156893108,,0,0,0,5.361660156893108,174.45957129332334,,0,0,0,174.45957129332334,58.80090378513154,,0,0,0,58.80090378513154,40.61163493865023,,0,0,0,40.61163493865023,116.60063277465868,,0,0,0,116.60063277465868
64,VAL,9.081947189116438,,0,0,0,9.081947189116438,4.909870985547786,,0,0,0,4.909870985547786,173.88408005520037,,0,0,0,173.88408005520037,57.66113704150849,,0,0,0,57.66113704150849,34.25136277804973,,0,0,0,34.25136277804973,121.20530213589188,,0,0,0,121.20530213589188
65,PRO,,,0,0,0,,4.238119858164058,,0,0,0,4.238119858164058,176.41234771941393,,0,0,0,176.41234771941393,63.11488729683649,,0,0,0,63.11488729683649,31.78985646822622,,0,0,0,31.78985646822622,,,0,0,0,
66,SER,8.39477464997225,,0,0,0,8.39477464997225,4.592414050527251,,0,0,0,4.592414050527251,174.07393100575536,,0,0,0,174.07393100575536,57.51393257136197,,0,0,0,57.51393257136197,65.06125773699634,,0,0,0,65.06125773699634,119.07716674875125,,0,0,0,119.07716674875125
67,GLU,8.899829711349762,,0,0,0,8.899829711349762,4.13553465979021,,0,0,0,4.13553465979021,176.35218028818403,,0,0,0,176.35218028818403,58.48823670357975,,0,0,0,58.48823670357975,29.51546525879676,,0,0,0,29.51546525879676,125.61626072694527,,0,0,0,125.61626072694527
68,LYS,8.03616114989455,,0,0,0,8.03616114989455,4.43330819956155,,0,0,0,4.43330819956155,175.8543265396437,,0,0,0,175.8543265396437,55.62064061819847,,0,0,0,55.62064061819847,33.67660648202354,,0,0,0,33.67660648202354,118.42195562384838,,0,0,0,118.42195562384838
69,GLY,8.112487307536908,,0,0,0,8.112487307536908,4.05313825534188,,0,0,0,4.05313825534188,172.67601636216563,,0,0,0,172.67601636216563,45.26758751815962,,0,0,0,45.26758751815962,,,0,0,0,,109.18161066787657,,0,0,0,109.18161066787657
70,GLU,8.493229180713731,,0,0,0,8.493229180713731,5.222167979154179,,0,0,0,5.222167979154179,175.39974209440558,,0,0,0,175.39974209440558,54.86258277118992,,0,0,0,54.86258277118992,33.066405398429346,,0,0,0,33.066405398429346,120.58060176546786,,0,0,0,120.58060176546786
71,VAL,9.099046929104228,,0,0,0,9.099046929104228,4.5377563468420465,,0,0,0,4.5377563468420465,174.9607499375014,,0,0,0,174.9607499375014,61.31444736703297,,0,0,0,61.31444736703297,34.61747110253081,,0,0,0,34.61747110253081,122.87207274316795,,0,0,0,122.87207274316795
72,HIS,9.03874865972916,,0,0,0,9.03874865972916,4.8998348085525585,,0,0,0,4.8998348085525585,174.65062119832945,,0,0,0,174.65062119832945,56.04239027673992,,0,0,0,56.04239027673992,29.85323205826951,,0,0,0,29.85323205826951,125.91822147631258,,0,0,0,125.91822147631258
73,GLY,9.159460616106117,,0,0,0,9.159460616106117,4.036962430477856,,0,0,0,4.036962430477856,171.93579651805973,,0,0,0,171.93579651805973,45.796797152142304,,0,0,0,45.796797152142304,,,0,0,0,,110.47145729424464,,0,0,0,110.47145729424464
74,LYS,8.749335147569097,,0,0,0,8.749335147569097,5.2273614296869795,,0,0,0,5.2273614296869795,174.5220143510767,,0,0,0,174.5220143510767,54.80886135653236,,0,0,0,54.80886135653236,37.209309628504826,,0,0,0,37.209309628504826,119.63669439064824,,0,0,0,119.63669439064824
75,VAL,9.221890833660781,,0,0,0,9.221890833660781,4.841488717760018,,0,0,0,4.841488717760018,175.28188854985015,,0,0,0,175.28188854985015,60.37113098605839,,0,0,0,60.37113098605839,32.6433020993784,,0,0,0,32.6433020993784,122.59653989435564,,0,0,0,122.59653989435564
76,LEU,9.244152373010325,,0,0,0,9.244152373010325,4.797782792740593,,0,0,0,4.797782792740593,175.56983446587302,,0,0,0,175.56983446587302,54.35445790689866,,0,0,0,54.35445790689866,42.02982582203352,,0,0,0,42.02982582203352,128.6161771060828,,0,0,0,128.6161771060828
77,MET,9.178625834670884,,0,0,0,9.178625834670884,4.707044781346432,,0,0,0,4.707044781346432,175.27672779103676,,0,0,0,175.27672779103676,55.17784583982129,,0,0,0,55.17784583982129,33.67652478992119,,0,0,0,33.67652478992119,124.12261053956598,,0,0,0,124.12261053956598
78,GLY,8.234708101903651,,0,0,0,8.234708101903651,4.014782541358642,,0,0,0,4.014782541358642,173.8997510724886,,0,0,0,173.8997510724886,46.45711090219225,,0,0,0,46.45711090219225,,,0,0,0,,109.45858631102786,,0,0,0,109.45858631102786
79,VAL,8.703032483599733,,0,0,0,8.703032483599733,4.154725032212232,,0,0,0,4.154725032212232,176.10982673125764,,0,0,0,176.10982673125764,63.09712250755911,,0,0,0,63.09712250755911,31.88916953815074,,0,0,0,31.88916953815074,121.66415356748251,,0,0,0,121.66415356748251
80,THR,8.842714692574093,,0,0,0,8.842714692574093,4.719244393506494,,0,0,0,4.719244393506494,176.22884334806858,,0,0,0,176.22884334806858,60.93836003644689,,0,0,0,60.93836003644689,71.60804721173271,,0,0,0,71.60804721173271,117.69694063155733,,0,0,0,117.69694063155733
81,SER,8.96792487991453,,0,0,0,8.96792487991453,4.224621923268398,,0,0,0,4.224621923268398,176.4662609657953,,0,0,0,176.4662609657953,61.99031997927628,,0,0,0,61.99031997927628,62.503842976079476,,0,0,0,62.503842976079476,117.5039166957265,,0,0,0,117.5039166957265
82,ASP,8.43554380956266,,0,0,0,8.43554380956266,4.469609982661782,,0,0,0,4.469609982661782,178.55764792731713,,0,0,0,178.55764792731713,57.24525704164724,,0,0,0,57.24525704164724,40.546827889288494,,0,0,0,40.546827889288494,122.23685533622489,,0,0,0,122.23685533622489
83,GLU,7.941239456399156,,0,0,0,7.941239456399156,4.025420160209236,,0,0,0,4.025420160209236,178.91196517445331,,0,0,0,178.91196517445331,59.26136782136197,,0,0,0,59.26136782136197,30.547632276467976,,0,0,0,30.547632276467976,120.32113418276724,,0,0,0,120.32113418276724
84,LEU,8.496966053590853,,0,0,0,8.496966053590853,4.045508143101343,,0,0,0,4.045508143101343,179.0003216528194,,0,0,0,179.0003216528194,57.66727564935065,,0,0,0,57.66727564935065,41.76188147703407,,0,0,0,41.76188147703407,122.70073878383837,,0,0,0,122.70073878383837
85,GLU,8.338351256660006,,0,0,0,8.338351256660006,4.025523082553558,,0,0,0,4.025523082553558,179.0192395385004,,0,0,0,179.0192395385004,59.468171232151185,,0,0,0,59.468171232151185,29.35344440685426,,0,0,0,29.35344440685426,119.6783705995782,,0,0,0,119.6783705995782
86,ASN,8.322525067560218,,0,0,0,8.322525067560218,4.461675643803419,,0,0,0,4.461675643803419,177.53833099743588,,0,0,0,177.53833099743588,55.80012038344434,,0,0,0,55.80012038344434,39.302624096303695,,0,0,0,39.302624096303695,118.71297393660784,,0,0,0,118.71297393660784
87,LEU,8.649548226218226,,0,0,0,8.649548226218226,3.804628451295927,,0,0,0,3.804628451295927,178.88357964300144,,0,0,0,178.88357964300144,57.94237624614829,,0,0,0,57.94237624614829,41.71488023590299,,0,0,0,41.71488023590299,120.90592118300587,,0,0,0,120.90592118300587
88,ASP,8.424435713447663,,0,0,0,8.424435713447663,4.32395328530636,,0,0,0,4.32395328530636,178.86522706983573,,0,0,0,178.86522706983573,57.7027582034299,,0,0,0,57.7027582034299,40.80512508165723,,0,0,0,40.80512508165723,120.38850427271063,,0,0,0,120.38850427271063
89,ALA,7.874482186363637,,0,0,0,7.874482186363637,4.177954156532357,,0,0,0,4.177954156532357,178.97085361191031,,0,0,0,178.97085361191031,54.370091172338775,,0,0,0,54.370091172338775,18.43468124005994,,0,0,0,18.43468124005994,121.30784889921745,,0,0,0,121.30784889921745