RESNUM,RESNAME,H_X,H_Y,H_BEST_REF_SCORE,H_BEST_REF_COV,H_BEST_REF_MATCH,H_UCBShift,HA_X,HA_Y,HA_BEST_REF_SCORE,HA_BEST_REF_COV,HA_BEST_REF_MATCH,HA_UCBShift,C_X,C_Y,C_BEST_REF_SCORE,C_BEST_REF_COV,C_BEST_REF_MATCH,C_UCBShift,CA_X,CA_Y,CA_BEST_REF_SCORE,CA_BEST_REF_COV,CA_BEST_REF_MATCH,CA_UCBShift,CB_X,CB_Y,CB_BEST_REF_SCORE,CB_BEST_REF_COV,CB_BEST_REF_MATCH,CB_UCBShift,N_X,N_Y,N_BEST_REF_SCORE,N_BEST_REF_COV,N_BEST_REF_MATCH,N_UCBShift
1,MET,8.434610288605837,,0,0,0,8.434610288605837,4.344882057647908,,0,0,0,4.344882057647908,174.57648511908093,,0,0,0,174.57648511908093,55.11302884099789,,0,0,0,55.11302884099789,33.219156173504274,,0,0,0,33.219156173504274,121.53859184144189,,0,0,0,121.53859184144189
2,ALA,8.259125456154957,,0,0,0,8.259125456154957,4.367305864388389,,0,0,0,4.367305864388389,177.1616083989788,,0,0,0,177.1616083989788,52.21303493894994,,0,0,0,52.21303493894994,18.95720406934177,,0,0,0,18.95720406934177,126.06219676124431,,0,0,0,126.06219676124431
3,THR,8.21793857929293,,0,0,0,8.21793857929293,4.553845485936287,,0,0,0,4.553845485936287,173.63572551277056,,0,0,0,173.63572551277056,59.458200215090464,,0,0,0,59.458200215090464,69.74279590134864,,0,0,0,69.74279590134864,117.55165198938283,,0,0,0,117.55165198938283
4,PRO,,,0,0,0,,4.569994389227439,,0,0,0,4.569994389227439,176.54266997305473,,0,0,0,176.54266997305473,62.98598598034188,,0,0,0,62.98598598034188,30.589079991869244,,0,0,0,30.589079991869244,,,0,0,0,
5,GLN,8.193293794627595,,0,0,0,8.193293794627595,4.453931607209457,,0,0,0,4.453931607209457,175.72581096524587,,0,0,0,175.72581096524587,55.431786774775226,,0,0,0,55.431786774775226,29.601455332117883,,0,0,0,29.601455332117883,121.20611713484848,,0,0,0,121.20611713484848
6,ASP,8.353070544927295,,0,0,0,8.353070544927295,4.532382938622488,,0,0,0,4.532382938622488,176.4713428310856,,0,0,0,176.4713428310856,54.131304435764235,,0,0,0,54.131304435764235,40.47735367438673,,0,0,0,40.47735367438673,121.69559335795871,,0,0,0,121.69559335795871
7,LYS,8.048801212470861,,0,0,0,8.048801212470861,4.115922462748363,,0,0,0,4.115922462748363,175.92354657783883,,0,0,0,175.92354657783883,56.10852688393273,,0,0,0,56.10852688393273,32.306668052680656,,0,0,0,32.306668052680656,122.78644903050284,,0,0,0,122.78644903050284
8,LEU,8.046549882301033,,0,0,0,8.046549882301033,4.171784386241536,,0,0,0,4.171784386241536,177.30923948938283,,0,0,0,177.30923948938283,54.917218596442446,,0,0,0,54.917218596442446,41.85919828627483,,0,0,0,41.85919828627483,125.23105287372073,,0,0,0,125.23105287372073
9,HIS,8.432496044233543,,0,0,0,8.432496044233543,4.476992060733711,,0,0,0,4.476992060733711,174.66184463878898,,0,0,0,174.66184463878898,56.459560706188256,,0,0,0,56.459560706188256,28.85349064032079,,0,0,0,28.85349064032079,122.63863603660229,,0,0,0,122.63863603660229
10,THR,8.163567750083251,,0,0,0,8.163567750083251,4.678379661971362,,0,0,0,4.678379661971362,174.38648646020644,,0,0,0,174.38648646020644,62.535726708885555,,0,0,0,62.535726708885555,69.83557825128204,,0,0,0,69.83557825128204,119.48993011494616,,0,0,0,119.48993011494616
11,VAL,8.90042643033633,,0,0,0,8.90042643033633,4.317947544394494,,0,0,0,4.317947544394494,174.60008206105007,,0,0,0,174.60008206105007,61.762564174031525,,0,0,0,61.762564174031525,33.934029148851145,,0,0,0,33.934029148851145,127.45207919418915,,0,0,0,127.45207919418915
12,ARG,8.557451018870019,,0,0,0,8.557451018870019,5.097782423409924,,0,0,0,5.097782423409924,175.42848287175048,,0,0,0,175.42848287175048,54.82862977302697,,0,0,0,54.82862977302697,31.521751181868133,,0,0,0,31.521751181868133,127.12783592558553,,0,0,0,127.12783592558553
13,LEU,8.924508852336553,,0,0,0,8.924508852336553,4.793876401265401,,0,0,0,4.793876401265401,174.64449759996668,,0,0,0,174.64449759996668,53.514285388073034,,0,0,0,53.514285388073034,44.40780538633589,,0,0,0,44.40780538633589,126.55417825154845,,0,0,0,126.55417825154845
14,PHE,8.654913115395717,,0,0,0,8.654913115395717,5.477103786202687,,0,0,0,5.477103786202687,175.61895950982353,,0,0,0,175.61895950982353,56.08498207684538,,0,0,0,56.08498207684538,41.805782272516375,,0,0,0,41.805782272516375,121.1571911087135,,0,0,0,121.1571911087135
15,GLY,8.892926941763792,,0,0,0,8.892926941763792,4.15586301537074,,0,0,0,4.15586301537074,170.62606967998113,,0,0,0,170.62606967998113,46.108644845609945,,0,0,0,46.108644845609945,,,0,0,0,,109.15313963752358,,0,0,0,109.15313963752358
16,THR,8.77662474047619,,0,0,0,8.77662474047619,4.9921906195526695,,0,0,0,4.9921906195526695,174.15292900020535,,0,0,0,174.15292900020535,61.760252397447,,0,0,0,61.760252397447,70.5706601013875,,0,0,0,70.5706601013875,117.85303664227995,,0,0,0,117.85303664227995
17,VAL,8.804560236169385,,0,0,0,8.804560236169385,4.198525145393495,,0,0,0,4.198525145393495,175.8380165948274,,0,0,0,175.8380165948274,63.356178213369965,,0,0,0,63.356178213369965,31.528940118692418,,0,0,0,31.528940118692418,126.73187345198691,,0,0,0,126.73187345198691
18,ALA,8.957183423670774,,0,0,0,8.957183423670774,4.2815438053779555,,0,0,0,4.2815438053779555,177.2828083486236,,0,0,0,177.2828083486236,52.4902614506105,,0,0,0,52.4902614506105,19.450234884065935,,0,0,0,19.450234884065935,131.8509725560939,,0,0,0,131.8509725560939
19,ALA,8.527328107414808,,0,0,0,8.527328107414808,4.144569416064491,,0,0,0,4.144569416064491,177.61644943539238,,0,0,0,177.61644943539238,53.71284464422799,,0,0,0,53.71284464422799,19.08878877548563,,0,0,0,19.08878877548563,122.93855934667555,,0,0,0,122.93855934667555
20,ASP,8.062918734881785,,0,0,0,8.062918734881785,4.64971741990787,,0,0,0,4.64971741990787,177.06146945004997,,0,0,0,177.06146945004997,54.547582402380954,,0,0,0,54.547582402380954,41.32710023186258,,0,0,0,41.32710023186258,116.34911301345878,,0,0,0,116.34911301345878
21,GLY,8.701770914985016,,0,0,0,8.701770914985016,3.9636666440864694,,0,0,0,3.9636666440864694,173.76545562270508,,0,0,0,173.76545562270508,45.8467991022311,,0,0,0,45.8467991022311,,,0,0,0,,112.10998790538905,,0,0,0,112.10998790538905
22,LEU,7.486414378255079,,0,0,0,7.486414378255079,4.829396937468088,,0,0,0,4.829396937468088,176.16931230259183,,0,0,0,176.16931230259183,55.34716522683983,,0,0,0,55.34716522683983,42.26280766368631,,0,0,0,42.26280766368631,121.91307526666111,,0,0,0,121.91307526666111
23,THR,8.956962892557444,,0,0,0,8.956962892557444,4.7274368057498055,,0,0,0,4.7274368057498055,173.41226506073926,,0,0,0,173.41226506073926,61.24085729248529,,0,0,0,61.24085729248529,70.95871716262072,,0,0,0,70.95871716262072,122.28688020604395,,0,0,0,122.28688020604395
24,MET,8.98302344054279,,0,0,0,8.98302344054279,4.6430233545399044,,0,0,0,4.6430233545399044,176.42687436961373,,0,0,0,176.42687436961373,55.7298999048174,,0,0,0,55.7298999048174,32.60528065426795,,0,0,0,32.60528065426795,124.77902590140415,,0,0,0,124.77902590140415
25,LEU,8.324126535059385,,0,0,0,8.324126535059385,4.399193268142969,,0,0,0,4.399193268142969,177.2176582028194,,0,0,0,177.2176582028194,54.97284900030525,,0,0,0,54.97284900030525,41.88042986747142,,0,0,0,41.88042986747142,123.96547161537906,,0,0,0,123.96547161537906
26,ASP,8.489070626667777,,0,0,0,8.489070626667777,4.51148859059829,,0,0,0,4.51148859059829,177.21599877074593,,0,0,0,177.21599877074593,55.36826705821401,,0,0,0,55.36826705821401,40.60150234908425,,0,0,0,40.60150234908425,125.042921295893,,0,0,0,125.042921295893
27,GLY,8.655661592868244,,0,0,0,8.655661592868244,3.937404152331002,,0,0,0,3.937404152331002,173.4444223914197,,0,0,0,173.4444223914197,45.48931682753913,,0,0,0,45.48931682753913,,,0,0,0,,110.88177536482407,,0,0,0,110.88177536482407
28,ALA,7.678432902186701,,0,0,0,7.678432902186701,4.716625966638917,,0,0,0,4.716625966638917,174.6201567089688,,0,0,0,174.6201567089688,50.193153384559885,,0,0,0,50.193153384559885,19.47571200701521,,0,0,0,19.47571200701521,123.89697021149406,,0,0,0,123.89697021149406
29,PRO,,,0,0,0,,4.436631418950494,,0,0,0,4.436631418950494,176.17757305551672,,0,0,0,176.17757305551672,63.35408698554223,,0,0,0,63.35408698554223,31.871841664663116,,0,0,0,31.871841664663116,,,0,0,0,
30,GLY,8.239042529193028,,0,0,0,8.239042529193028,4.088819999000999,,0,0,0,4.088819999000999,172.4301640261461,,0,0,0,172.4301640261461,45.63011622757798,,0,0,0,45.63011622757798,,,0,0,0,,109.00199572496948,,0,0,0,109.00199572496948
31,VAL,9.064562476312576,,0,0,0,9.064562476312576,4.990720800599401,,0,0,0,4.990720800599401,172.73442092061273,,0,0,0,172.73442092061273,59.56818561966922,,0,0,0,59.56818561966922,35.16721969361195,,0,0,0,35.16721969361195,116.497601456216,,0,0,0,116.497601456216
32,ARG,9.087511293578643,,0,0,0,9.087511293578643,5.685462257209457,,0,0,0,5.685462257209457,175.41979526544011,,0,0,0,175.41979526544011,54.496856516877564,,0,0,0,54.496856516877564,32.909821616588964,,0,0,0,32.909821616588964,127.64870272523032,,0,0,0,127.64870272523032
33,PHE,9.342029608175158,,0,0,0,9.342029608175158,5.621450985919637,,0,0,0,5.621450985919637,172.07116311795428,,0,0,0,172.07116311795428,55.539176510572766,,0,0,0,55.539176510572766,41.75739756064491,,0,0,0,41.75739756064491,122.73945291061716,,0,0,0,122.73945291061716
34,ARG,9.027198100677102,,0,0,0,9.027198100677102,4.554686654673105,,0,0,0,4.554686654673105,174.68334390330227,,0,0,0,174.68334390330227,55.01354721163836,,0,0,0,55.01354721163836,32.466146946226,,0,0,0,32.466146946226,120.3133670020646,,0,0,0,120.3133670020646
35,LEU,9.063904393772892,,0,0,0,9.063904393772892,5.183667684249085,,0,0,0,5.183667684249085,175.22752452969252,,0,0,0,175.22752452969252,53.7089454979576,,0,0,0,53.7089454979576,44.18157677141192,,0,0,0,44.18157677141192,127.65068028093573,,0,0,0,127.65068028093573
36,GLU,9.070928916072816,,0,0,0,9.070928916072816,4.6528350966588965,,0,0,0,4.6528350966588965,176.32766028181263,,0,0,0,176.32766028181263,56.077634600111004,,0,0,0,56.077634600111004,30.69244040006105,,0,0,0,30.69244040006105,127.61135298325564,,0,0,0,127.61135298325564
37,ASP,8.596756887939838,,0,0,0,8.596756887939838,4.60704757020202,,0,0,0,4.60704757020202,176.67088459387836,,0,0,0,176.67088459387836,54.53775574466645,,0,0,0,54.53775574466645,42.47792440933511,,0,0,0,42.47792440933511,124.78356442864913,,0,0,0,124.78356442864913
38,LYS,8.797488129897879,,0,0,0,8.797488129897879,4.104772609521034,,0,0,0,4.104772609521034,176.9909965193029,,0,0,0,176.9909965193029,57.95054319009879,,0,0,0,57.95054319009879,32.54844126371407,,0,0,0,32.54844126371407,123.64089446149961,,0,0,0,123.64089446149961
39,ASP,8.417862195254745,,0,0,0,8.417862195254745,4.610996442307692,,0,0,0,4.610996442307692,176.48180165937399,,0,0,0,176.48180165937399,55.26710956339772,,0,0,0,55.26710956339772,41.8040459981241,,0,0,0,41.8040459981241,118.69989424622045,,0,0,0,118.69989424622045
40,ASN,8.333176662065712,,0,0,0,8.333176662065712,4.8122280495005,,0,0,0,4.8122280495005,175.34440262835497,,0,0,0,175.34440262835497,52.93591509227439,,0,0,0,52.93591509227439,38.77027880647685,,0,0,0,38.77027880647685,117.40368161899767,,0,0,0,117.40368161899767
41,THR,8.497556062631812,,0,0,0,8.497556062631812,4.086568629273504,,0,0,0,4.086568629273504,175.3902660514652,,0,0,0,175.3902660514652,63.79750622709513,,0,0,0,63.79750622709513,68.89009879484405,,0,0,0,68.89009879484405,116.96017993976024,,0,0,0,116.96017993976024
42,SER,8.204570195354647,,0,0,0,8.204570195354647,4.338058467632368,,0,0,0,4.338058467632368,174.82887144619824,,0,0,0,174.82887144619824,59.22840038126318,,0,0,0,59.22840038126318,63.67779994413364,,0,0,0,63.67779994413364,116.07460358035853,,0,0,0,116.07460358035853
43,LYS,7.662557813447663,,0,0,0,7.662557813447663,4.473964047241647,,0,0,0,4.473964047241647,175.03599089118657,,0,0,0,175.03599089118657,55.72818707559108,,0,0,0,55.72818707559108,32.88877595602176,,0,0,0,32.88877595602176,123.24752825234211,,0,0,0,123.24752825234211
44,THR,8.348149954634255,,0,0,0,8.348149954634255,5.172306104950604,,0,0,0,5.172306104950604,173.72486581066156,,0,0,0,173.72486581066156,60.09154130925741,,0,0,0,60.09154130925741,71.29483612877678,,0,0,0,71.29483612877678,116.53110154807415,,0,0,0,116.53110154807415
45,VAL,8.87718775112665,,0,0,0,8.87718775112665,4.276416146381396,,0,0,0,4.276416146381396,174.98921179064826,,0,0,0,174.98921179064826,60.56195707111222,,0,0,0,60.56195707111222,33.821929108169606,,0,0,0,33.821929108169606,124.33745566544567,,0,0,0,124.33745566544567
46,TRP,8.580341657287157,,0,0,0,8.580341657287157,4.668161989987791,,0,0,0,4.668161989987791,175.01382809410035,,0,0,0,175.01382809410035,58.22219411875347,,0,0,0,58.22219411875347,30.682452313913867,,0,0,0,30.682452313913867,128.1843346279387,,0,0,0,128.1843346279387
47,VAL,9.037731798068597,,0,0,0,9.037731798068597,4.975932804428905,,0,0,0,4.975932804428905,173.9151651521312,,0,0,0,173.9151651521312,60.628502806865356,,0,0,0,60.628502806865356,34.08591915722056,,0,0,0,34.08591915722056,123.899273650777,,0,0,0,123.899273650777
48,LEU,9.117229805094906,,0,0,0,9.117229805094906,5.1601850877122875,,0,0,0,5.1601850877122875,175.36252605976244,,0,0,0,175.36252605976244,53.7124534001998,,0,0,0,53.7124534001998,44.9852581015984,,0,0,0,44.9852581015984,129.0725967930847,,0,0,0,129.0725967930847
49,TYR,9.53807633449883,,0,0,0,9.53807633449883,5.363009376362527,,0,0,0,5.363009376362527,173.9244888445721,,0,0,0,173.9244888445721,55.8394614997114,,0,0,0,55.8394614997114,41.46576340906316,,0,0,0,41.46576340906316,129.2882344614108,,0,0,0,129.2882344614108
50,LYS,7.987635270362969,,0,0,0,7.987635270362969,4.575309018742369,,0,0,0,4.575309018742369,175.4661099656399,,0,0,0,175.4661099656399,55.38256751618937,,0,0,0,55.38256751618937,33.62964397439228,,0,0,0,33.62964397439228,127.49415588180707,,0,0,0,127.49415588180707
51,GLY,8.34990951007326,,0,0,0,8.34990951007326,3.9475844309745813,,0,0,0,3.9475844309745813,172.58131096740482,,0,0,0,172.58131096740482,44.748164367848815,,0,0,0,44.748164367848815,,,0,0,0,,111.21179428870573,,0,0,0,111.21179428870573
52,ALA,8.223306491797093,,0,0,0,8.223306491797093,4.30701328977689,,0,0,0,4.30701328977689,176.99674449820736,,0,0,0,176.99674449820736,52.51307462284937,,0,0,0,52.51307462284937,18.925309104334556,,0,0,0,18.925309104334556,122.6211593108669,,0,0,0,122.6211593108669
53,VAL,8.424044349672549,,0,0,0,8.424044349672549,4.185896594677545,,0,0,0,4.185896594677545,175.13610868878345,,0,0,0,175.13610868878345,59.949325294838495,,0,0,0,59.949325294838495,32.369207814063714,,0,0,0,32.369207814063714,123.04283485711511,,0,0,0,123.04283485711511
54,PRO,,,0,0,0,,4.54803662936508,,0,0,0,4.54803662936508,177.20704825419583,,0,0,0,177.20704825419583,62.88648755558886,,0,0,0,62.88648755558886,32.66825003111888,,0,0,0,32.66825003111888,,,0,0,0,
55,ASP,8.65401605982351,,0,0,0,8.65401605982351,4.444667271903096,,0,0,0,4.444667271903096,176.88019262545788,,0,0,0,176.88019262545788,56.20436584084249,,0,0,0,56.20436584084249,40.412732605777556,,0,0,0,40.412732605777556,121.1308193401654,,0,0,0,121.1308193401654
56,THR,7.618021672499723,,0,0,0,7.618021672499723,4.304618407498057,,0,0,0,4.304618407498057,174.8055317660839,,0,0,0,174.8055317660839,61.68873097754467,,0,0,0,61.68873097754467,69.27270293279499,,0,0,0,69.27270293279499,107.26352883580309,,0,0,0,107.26352883580309
57,PHE,8.060213499156399,,0,0,0,8.060213499156399,4.167951447752247,,0,0,0,4.167951447752247,173.96652779277946,,0,0,0,173.96652779277946,59.05163211428017,,0,0,0,59.05163211428017,38.70818687605173,,0,0,0,38.70818687605173,123.69977384437229,,0,0,0,123.69977384437229
58,LYS,6.8895347952269965,,0,0,0,6.8895347952269965,4.505537462598513,,0,0,0,4.505537462598513,173.00530135601622,,0,0,0,173.00530135601622,53.086002185769786,,0,0,0,53.086002185769786,33.88818142535243,,0,0,0,33.88818142535243,127.49095529175268,,0,0,0,127.49095529175268
59,PRO,,,0,0,0,,3.90669604836275,,0,0,0,3.90669604836275,177.95425418015873,,0,0,0,177.95425418015873,63.88200258101898,,0,0,0,63.88200258101898,31.431834594882897,,0,0,0,31.431834594882897,,,0,0,0,
60,GLY,8.897135733910535,,0,0,0,8.897135733910535,3.866992593120768,,0,0,0,3.866992593120768,174.123466628466,,0,0,0,174.123466628466,45.124633515334665,,0,0,0,45.124633515334665,,,0,0,0,,112.80466804221334,,0,0,0,112.80466804221334
61,VAL,7.436537066822066,,0,0,0,7.436537066822066,3.9723562405233652,,0,0,0,3.9723562405233652,175.38927893411034,,0,0,0,175.38927893411034,62.44354319042069,,0,0,0,62.44354319042069,32.771518402097904,,0,0,0,32.771518402097904,122.87766195219226,,0,0,0,122.87766195219226
62,GLU,8.66833399107004,,0,0,0,8.66833399107004,4.992345333144633,,0,0,0,4.992345333144633,175.98626712768342,,0,0,0,175.98626712768342,56.399429765046065,,0,0,0,56.399429765046065,30.462326658663557,,0,0,0,30.462326658663557,126.95579224761904,,0,0,0,126.95579224761904
63,VAL,9.035537992007992,,0,0,0,9.035537992007992,5.246696477788878,,0,0,0,5.246696477788878,174.3037844978466,,0,0,0,174.3037844978466,58.80534899798535,,0,0,0,58.80534899798535,35.20669288469864,,0,0,0,35.20669288469864,118.04255212838828,,0,0,0,118.04255212838828
64,ILE,8.91104603111888,,0,0,0,8.91104603111888,4.742835742124543,,0,0,0,4.742835742124543,175.48678695990122,,0,0,0,175.48678695990122,59.99787974298479,,0,0,0,59.99787974298479,40.04356885441226,,0,0,0,40.04356885441226,121.79345816744922,,0,0,0,121.79345816744922
65,ILE,8.932016254895105,,0,0,0,8.932016254895105,5.196917742779443,,0,0,0,5.196917742779443,174.67058947611832,,0,0,0,174.67058947611832,58.639681227095124,,0,0,0,58.639681227095124,41.56206017428127,,0,0,0,41.56206017428127,124.03489048053613,,0,0,0,124.03489048053613
66,GLU,8.685838686463537,,0,0,0,8.685838686463537,5.594618311555111,,0,0,0,5.594618311555111,176.2478243621878,,0,0,0,176.2478243621878,54.43032851048951,,0,0,0,54.43032851048951,33.17500699256299,,0,0,0,33.17500699256299,123.60069608282828,,0,0,0,123.60069608282828
67,GLY,9.19750758964369,,0,0,0,9.19750758964369,4.223819138306138,,0,0,0,4.223819138306138,172.24893057702852,,0,0,0,172.24893057702852,46.468754803041406,,0,0,0,46.468754803041406,,,0,0,0,,110.23079678981019,,0,0,0,110.23079678981019
68,GLY,7.824951543839494,,0,0,0,7.824951543839494,4.134371607950383,,0,0,0,4.134371607950383,172.03515815110444,,0,0,0,172.03515815110444,44.83379797693973,,0,0,0,44.83379797693973,,,0,0,0,,107.91317752319347,,0,0,0,107.91317752319347
69,LEU,8.452811494588746,,0,0,0,8.452811494588746,4.543366006043956,,0,0,0,4.543366006043956,176.60902239348982,,0,0,0,176.60902239348982,54.00442239596514,,0,0,0,54.00442239596514,43.306138304251306,,0,0,0,43.306138304251306,124.50496170367965,,0,0,0,124.50496170367965
70,ALA,8.508039832639582,,0,0,0,8.508039832639582,4.541834284473859,,0,0,0,4.541834284473859,175.89315137043513,,0,0,0,175.89315137043513,50.428724625208126,,0,0,0,50.428724625208126,18.016845474159176,,0,0,0,18.016845474159176,129.29769789562658,,0,0,0,129.29769789562658
71,PRO,,,0,0,0,,4.314813570246421,,0,0,0,4.314813570246421,178.02870021994673,,0,0,0,178.02870021994673,63.9778629007548,,0,0,0,63.9778629007548,31.55265573913309,,0,0,0,31.55265573913309,,,0,0,0,
72,GLY,8.905900818564769,,0,0,0,8.905900818564769,3.9542025830724827,,0,0,0,3.9542025830724827,174.05363924680876,,0,0,0,174.05363924680876,45.3927867022311,,0,0,0,45.3927867022311,,,0,0,0,,113.5275848545954,,0,0,0,113.5275848545954
73,GLU,7.887091744255744,,0,0,0,7.887091744255744,4.495366272766122,,0,0,0,4.495366272766122,176.55250375799756,,0,0,0,176.55250375799756,55.84875717143967,,0,0,0,55.84875717143967,30.792102548823397,,0,0,0,30.792102548823397,121.84298659153625,,0,0,0,121.84298659153625
74,ASP,8.587993244866245,,0,0,0,8.587993244866245,4.768396322069597,,0,0,0,4.768396322069597,175.8638322074592,,0,0,0,175.8638322074592,54.76244633004773,,0,0,0,54.76244633004773,41.54656708618604,,0,0,0,41.54656708618604,123.44865880293041,,0,0,0,123.44865880293041
75,THR,7.778962661211011,,0,0,0,7.778962661211011,5.11215896937507,,0,0,0,5.11215896937507,173.94928504759127,,0,0,0,173.94928504759127,62.00116641567321,,0,0,0,62.00116641567321,69.47260768311688,,0,0,0,69.47260768311688,115.75579501598956,,0,0,0,115.75579501598956
76,PHE,9.464141586496837,,0,0,0,9.464141586496837,4.471066100033299,,0,0,0,4.471066100033299,173.7681701639083,,0,0,0,173.7681701639083,57.856313671778224,,0,0,0,57.856313671778224,40.34499592053502,,0,0,0,40.34499592053502,128.4423789049062,,0,0,0,128.4423789049062
77,LYS,8.710754635464534,,0,0,0,8.710754635464534,4.744538579886781,,0,0,0,4.744538579886781,175.8179360661172,,0,0,0,175.8179360661172,55.322531608452664,,0,0,0,55.322531608452664,32.913413046448,,0,0,0,32.913413046448,129.27717055798092,,0,0,0,129.27717055798092
78,ALA,9.04618241050061,,0,0,0,9.04618241050061,4.784604557819958,,0,0,0,4.784604557819958,176.85199817749472,,0,0,0,176.85199817749472,51.855156044905094,,0,0,0,51.855156044905094,20.194101519930072,,0,0,0,20.194101519930072,129.78155979020426,,0,0,0,129.78155979020426
79,ARG,9.122137052619603,,0,0,0,9.122137052619603,4.682438936413586,,0,0,0,4.682438936413586,176.47517893328896,,0,0,0,176.47517893328896,56.364260293883895,,0,0,0,56.364260293883895,31.396594127927628,,0,0,0,31.396594127927628,121.72549792423132,,0,0,0,121.72549792423132
80,THR,8.265885847896548,,0,0,0,8.265885847896548,4.8448682287046285,,0,0,0,4.8448682287046285,173.17749488109666,,0,0,0,173.17749488109666,60.850351065157064,,0,0,0,60.850351065157064,71.04345597239983,,0,0,0,71.04345597239983,112.72558241152736,,0,0,0,112.72558241152736
81,LEU,8.347824943273393,,0,0,0,8.347824943273393,4.666896377833278,,0,0,0,4.666896377833278,174.6188709009657,,0,0,0,174.6188709009657,54.175366101959156,,0,0,0,54.175366101959156,42.85906312224442,,0,0,0,42.85906312224442,126.34419045127095,,0,0,0,126.34419045127095
82,MET,9.157769213381062,,0,0,0,9.157769213381062,4.85407057982573,,0,0,0,4.85407057982573,175.06471959556,,0,0,0,175.06471959556,54.00963021558441,,0,0,0,54.00963021558441,36.23770908493728,,0,0,0,36.23770908493728,125.64360263830058,,0,0,0,125.64360263830058
83,THR,8.75106344017094,,0,0,0,8.75106344017094,4.706061976445776,,0,0,0,4.706061976445776,174.50508370179818,,0,0,0,174.50508370179818,61.58690408467643,,0,0,0,61.58690408467643,69.82248412405927,,0,0,0,69.82248412405927,117.76867429307359,,0,0,0,117.76867429307359
84,LYS,8.650020889715838,,0,0,0,8.650020889715838,4.2842275658064155,,0,0,0,4.2842275658064155,176.20447494017094,,0,0,0,176.20447494017094,56.461471644128096,,0,0,0,56.461471644128096,32.753772482079036,,0,0,0,32.753772482079036,125.76405174286269,,0,0,0,125.76405174286269
85,CYS,8.544534657242759,,0,0,0,8.544534657242759,4.490544547466422,,0,0,0,4.490544547466422,173.0160486526085,,0,0,0,173.0160486526085,57.05446814594294,,0,0,0,57.05446814594294,27.40931248008103,,0,0,0,27.40931248008103,123.07321329608725,,0,0,0,123.07321329608725
86,PRO,,,0,0,0,,4.4479743691364195,,0,0,0,4.4479743691364195,177.02902897432014,,0,0,0,177.02902897432014,62.765727555505606,,0,0,0,62.765727555505606,31.901357433749585,,0,0,0,31.901357433749585,,,0,0,0,
87,LEU,8.475460291003442,,0,0,0,8.475460291003442,4.230556617443668,,0,0,0,4.230556617443668,177.4380890542624,,0,0,0,177.4380890542624,55.089011469669224,,0,0,0,55.089011469669224,41.69811585038295,,0,0,0,41.69811585038295,124.89603276411366,,0,0,0,124.89603276411366
88,GLU,8.444601095493395,,0,0,0,8.444601095493395,4.365787193792318,,0,0,0,4.365787193792318,176.5284389596792,,0,0,0,176.5284389596792,56.295649783549784,,0,0,0,56.295649783549784,29.062562704689753,,0,0,0,29.062562704689753,123.64389835909647,,0,0,0,123.64389835909647
89,HIS,8.296830325951825,,0,0,0,8.296830325951825,4.352243964246864,,0,0,0,4.352243964246864,175.04950808911644,,0,0,0,175.04950808911644,56.36323581442446,,0,0,0,56.36323581442446,28.83631222125097,,0,0,0,28.83631222125097,121.5744890541403,,0,0,0,121.5744890541403
90,HIS,8.324459540670441,,0,0,0,8.324459540670441,4.439641589554889,,0,0,0,4.439641589554889,174.572108402886,,0,0,0,174.572108402886,55.34723918266733,,0,0,0,55.34723918266733,29.293264588267288,,0,0,0,29.293264588267288,120.43981807236652,,0,0,0,120.43981807236652