RESNUM,RESNAME,H_X,H_Y,H_BEST_REF_SCORE,H_BEST_REF_COV,H_BEST_REF_MATCH,H_UCBShift,HA_X,HA_Y,HA_BEST_REF_SCORE,HA_BEST_REF_COV,HA_BEST_REF_MATCH,HA_UCBShift,C_X,C_Y,C_BEST_REF_SCORE,C_BEST_REF_COV,C_BEST_REF_MATCH,C_UCBShift,CA_X,CA_Y,CA_BEST_REF_SCORE,CA_BEST_REF_COV,CA_BEST_REF_MATCH,CA_UCBShift,CB_X,CB_Y,CB_BEST_REF_SCORE,CB_BEST_REF_COV,CB_BEST_REF_MATCH,CB_UCBShift,N_X,N_Y,N_BEST_REF_SCORE,N_BEST_REF_COV,N_BEST_REF_MATCH,N_UCBShift
1,MET,8.429319192518593,,0,0,0,8.429319192518593,4.404773996392496,,0,0,0,4.404773996392496,174.66480922937617,,0,0,0,174.66480922937617,54.9726797041181,,0,0,0,54.9726797041181,33.71727514506049,,0,0,0,33.71727514506049,121.41570888956598,,0,0,0,121.41570888956598
2,ASN,9.079241644438895,,0,0,0,9.079241644438895,5.046222681862583,,0,0,0,5.046222681862583,175.53046816691085,,0,0,0,175.53046816691085,51.73020793021978,,0,0,0,51.73020793021978,39.68287796635032,,0,0,0,39.68287796635032,125.69608815036631,,0,0,0,125.69608815036631
3,ARG,8.9374544495116,,0,0,0,8.9374544495116,3.82805961993007,,0,0,0,3.82805961993007,177.320908861544,,0,0,0,177.320908861544,60.56241508542013,,0,0,0,60.56241508542013,30.50199040994006,,0,0,0,30.50199040994006,119.12103301468531,,0,0,0,119.12103301468531
4,GLN,8.309256242562993,,0,0,0,8.309256242562993,4.05203553997114,,0,0,0,4.05203553997114,178.00260252547452,,0,0,0,178.00260252547452,58.628230713253416,,0,0,0,58.628230713253416,28.29026358902764,,0,0,0,28.29026358902764,117.95135471844266,,0,0,0,117.95135471844266
5,GLN,8.30493721071706,,0,0,0,8.30493721071706,4.185885070851371,,0,0,0,4.185885070851371,178.57305705333556,,0,0,0,178.57305705333556,58.85909401367522,,0,0,0,58.85909401367522,28.710171834343434,,0,0,0,28.710171834343434,119.62347311862581,,0,0,0,119.62347311862581
6,PHE,8.49610960933511,,0,0,0,8.49610960933511,4.218776682212232,,0,0,0,4.218776682212232,176.8202019594461,,0,0,0,176.8202019594461,60.849909736846485,,0,0,0,60.849909736846485,39.5774221017649,,0,0,0,39.5774221017649,122.35658747334887,,0,0,0,122.35658747334887
7,ILE,8.528245687884338,,0,0,0,8.528245687884338,3.317002389926742,,0,0,0,3.317002389926742,177.53859020239761,,0,0,0,177.53859020239761,65.79195997267732,,0,0,0,65.79195997267732,38.061041736946386,,0,0,0,38.061041736946386,120.08224958646909,,0,0,0,120.08224958646909
8,ASP,8.431437574697524,,0,0,0,8.431437574697524,4.4449661188866685,,0,0,0,4.4449661188866685,178.68650178078033,,0,0,0,178.68650178078033,57.32506102578533,,0,0,0,57.32506102578533,40.13275379472195,,0,0,0,40.13275379472195,119.81719349997225,,0,0,0,119.81719349997225
9,TYR,8.289218867427017,,0,0,0,8.289218867427017,4.0858744448384945,,0,0,0,4.0858744448384945,177.52469612837163,,0,0,0,177.52469612837163,61.83345257786103,,0,0,0,61.83345257786103,38.74277798339438,,0,0,0,38.74277798339438,122.7762317017205,,0,0,0,122.7762317017205
10,ALA,8.556675116916416,,0,0,0,8.556675116916416,3.983833339146964,,0,0,0,3.983833339146964,179.26967581565657,,0,0,0,179.26967581565657,55.30624078782884,,0,0,0,55.30624078782884,18.142767042535244,,0,0,0,18.142767042535244,122.601365099223,,0,0,0,122.601365099223
11,GLN,8.390500452103453,,0,0,0,8.390500452103453,4.047132758119658,,0,0,0,4.047132758119658,178.50807131694418,,0,0,0,178.50807131694418,58.39041681459651,,0,0,0,58.39041681459651,28.602241470113217,,0,0,0,28.602241470113217,118.19284306773227,,0,0,0,118.19284306773227
12,LYS,8.035903775235875,,0,0,0,8.035903775235875,4.005397590431791,,0,0,0,4.005397590431791,178.28435471971918,,0,0,0,178.28435471971918,58.659125095854144,,0,0,0,58.659125095854144,32.405089575124876,,0,0,0,32.405089575124876,119.8072979478133,,0,0,0,119.8072979478133
13,LYS,7.984477642224442,,0,0,0,7.984477642224442,3.7993311166694417,,0,0,0,3.7993311166694417,177.96142221461872,,0,0,0,177.96142221461872,58.22558143475413,,0,0,0,58.22558143475413,33.5230883453269,,0,0,0,33.5230883453269,117.31015701455767,,0,0,0,117.31015701455767
14,TYR,7.864363810317459,,0,0,0,7.864363810317459,4.617133705752581,,0,0,0,4.617133705752581,176.32249032788323,,0,0,0,176.32249032788323,57.654024315823065,,0,0,0,57.654024315823065,39.893002745981796,,0,0,0,39.893002745981796,113.9726855361028,,0,0,0,113.9726855361028
15,ASP,7.7357872755910755,,0,0,0,7.7357872755910755,4.53856800090465,,0,0,0,4.53856800090465,175.80811510392942,,0,0,0,175.80811510392942,55.31027096512376,,0,0,0,55.31027096512376,40.15565399318459,,0,0,0,40.15565399318459,118.78722935768121,,0,0,0,118.78722935768121
16,THR,7.926682921095572,,0,0,0,7.926682921095572,4.4896054698079695,,0,0,0,4.4896054698079695,174.39813407531355,,0,0,0,174.39813407531355,63.076083350138745,,0,0,0,63.076083350138745,69.82362727624597,,0,0,0,69.82362727624597,115.88140507394827,,0,0,0,115.88140507394827
17,LYS,8.38200761979687,,0,0,0,8.38200761979687,4.727847679209679,,0,0,0,4.727847679209679,174.323049588567,,0,0,0,174.323049588567,53.67189430325231,,0,0,0,53.67189430325231,32.498523155350206,,0,0,0,32.498523155350206,127.05166458271172,,0,0,0,127.05166458271172
18,PRO,,,0,0,0,,3.6555672312687317,,0,0,0,3.6555672312687317,175.4977935821734,,0,0,0,175.4977935821734,62.61681131572871,,0,0,0,62.61681131572871,31.37769447079587,,0,0,0,31.37769447079587,,,0,0,0,
19,ASP,8.557999188023087,,0,0,0,8.557999188023087,4.589311123143523,,0,0,0,4.589311123143523,175.3521232478688,,0,0,0,175.3521232478688,53.35936268361083,,0,0,0,53.35936268361083,42.147457842779446,,0,0,0,42.147457842779446,123.88911122077923,,0,0,0,123.88911122077923
20,HIS,8.604773755061604,,0,0,0,8.604773755061604,5.153573697902098,,0,0,0,5.153573697902098,173.41373143442667,,0,0,0,173.41373143442667,53.527883436208235,,0,0,0,53.527883436208235,29.565289984676436,,0,0,0,29.565289984676436,121.61002210223666,,0,0,0,121.61002210223666
21,PRO,,,0,0,0,,4.2686906260350765,,0,0,0,4.2686906260350765,175.59902912272173,,0,0,0,175.59902912272173,63.50422310665446,,0,0,0,63.50422310665446,31.80969018686869,,0,0,0,31.80969018686869,,,0,0,0,
22,TRP,7.6913193696636695,,0,0,0,7.6913193696636695,4.834108069841269,,0,0,0,4.834108069841269,176.79328110064378,,0,0,0,176.79328110064378,56.31818389620935,,0,0,0,56.31818389620935,29.71973168778444,,0,0,0,29.71973168778444,121.08576506566766,,0,0,0,121.08576506566766
23,GLU,9.095588463591962,,0,0,0,9.095588463591962,4.0628605248335,,0,0,0,4.0628605248335,177.47700589078144,,0,0,0,177.47700589078144,58.682242536918636,,0,0,0,58.682242536918636,29.412815905860803,,0,0,0,29.412815905860803,123.74871997465867,,0,0,0,123.74871997465867
24,LYS,8.13162701047841,,0,0,0,8.13162701047841,4.034773695221445,,0,0,0,4.034773695221445,175.9655386143412,,0,0,0,175.9655386143412,56.94692123764014,,0,0,0,56.94692123764014,32.97235137886558,,0,0,0,32.97235137886558,116.43148429695304,,0,0,0,116.43148429695304
25,PHE,7.730090337595739,,0,0,0,7.730090337595739,5.057644230808081,,0,0,0,5.057644230808081,174.67849017940392,,0,0,0,174.67849017940392,55.21421075457321,,0,0,0,55.21421075457321,39.11758062862138,,0,0,0,39.11758062862138,118.46235615284715,,0,0,0,118.46235615284715
26,PRO,,,0,0,0,,4.429526283738484,,0,0,0,4.429526283738484,177.0968550008991,,0,0,0,177.0968550008991,64.68345809184704,,0,0,0,64.68345809184704,31.805317454551005,,0,0,0,31.805317454551005,,,0,0,0,
27,ASP,8.645860003052503,,0,0,0,8.645860003052503,4.676562454020979,,0,0,0,4.676562454020979,176.530024082018,,0,0,0,176.530024082018,54.31862593069153,,0,0,0,54.31862593069153,40.5319782993118,,0,0,0,40.5319782993118,116.13486995349652,,0,0,0,116.13486995349652
28,TYR,7.988191323598623,,0,0,0,7.988191323598623,5.595490903618604,,0,0,0,5.595490903618604,176.07093675423465,,0,0,0,176.07093675423465,57.86684789266844,,0,0,0,57.86684789266844,39.34401361224886,,0,0,0,39.34401361224886,120.47229933549228,,0,0,0,120.47229933549228
29,ALA,9.228383564790766,,0,0,0,9.228383564790766,5.2197348419302925,,0,0,0,5.2197348419302925,175.20390213729604,,0,0,0,175.20390213729604,50.36775426229881,,0,0,0,50.36775426229881,22.227797978726826,,0,0,0,22.227797978726826,125.70002156905872,,0,0,0,125.70002156905872
30,VAL,8.643520654245753,,0,0,0,8.643520654245753,4.239615683233433,,0,0,0,4.239615683233433,174.51749966734377,,0,0,0,174.51749966734377,61.74726240152625,,0,0,0,61.74726240152625,32.4745680558386,,0,0,0,32.4745680558386,121.91058244183594,,0,0,0,121.91058244183594
31,PHE,9.141856337079588,,0,0,0,9.141856337079588,4.78206200062715,,0,0,0,4.78206200062715,174.25649321227107,,0,0,0,174.25649321227107,56.680273843173495,,0,0,0,56.680273843173495,41.085537478793434,,0,0,0,41.085537478793434,126.82576871369741,,0,0,0,126.82576871369741
32,ARG,8.579520402913753,,0,0,0,8.579520402913753,5.3954531594017086,,0,0,0,5.3954531594017086,175.45907467915973,,0,0,0,175.45907467915973,53.880924073448774,,0,0,0,53.880924073448774,33.5336872983905,,0,0,0,33.5336872983905,120.83191338812298,,0,0,0,120.83191338812298
33,HIS,8.787552627655678,,0,0,0,8.787552627655678,4.525658554273504,,0,0,0,4.525658554273504,177.23912960968477,,0,0,0,177.23912960968477,57.326521757997554,,0,0,0,57.326521757997554,31.003274080136528,,0,0,0,31.003274080136528,119.5965947932845,,0,0,0,119.5965947932845
34,SER,8.887162968009768,,0,0,0,8.887162968009768,4.355310845365745,,0,0,0,4.355310845365745,175.29071006886446,,0,0,0,175.29071006886446,60.52332144299589,,0,0,0,60.52332144299589,62.89909493676878,,0,0,0,62.89909493676878,117.86538012263847,,0,0,0,117.86538012263847
35,ASP,8.522692297358198,,0,0,0,8.522692297358198,4.660122068034743,,0,0,0,4.660122068034743,177.0048062750694,,0,0,0,177.0048062750694,55.72478232838273,,0,0,0,55.72478232838273,39.800476151282055,,0,0,0,39.800476151282055,120.34908913567544,,0,0,0,120.34908913567544
36,ASN,7.949062368603619,,0,0,0,7.949062368603619,4.873358993711844,,0,0,0,4.873358993711844,175.1240053129981,,0,0,0,175.1240053129981,52.514075247929846,,0,0,0,52.514075247929846,39.2207697047286,,0,0,0,39.2207697047286,115.00634441060606,,0,0,0,115.00634441060606
37,ASP,8.248928706576756,,0,0,0,8.248928706576756,4.544585320659896,,0,0,0,4.544585320659896,175.74472727813298,,0,0,0,175.74472727813298,55.999193826151625,,0,0,0,55.999193826151625,40.00417517559108,,0,0,0,40.00417517559108,116.50753946904763,,0,0,0,116.50753946904763
38,LYS,8.41776971110556,,0,0,0,8.41776971110556,4.328674876778777,,0,0,0,4.328674876778777,176.12873277671773,,0,0,0,176.12873277671773,56.88816337493618,,0,0,0,56.88816337493618,33.21998742195027,,0,0,0,33.21998742195027,120.35147793606949,,0,0,0,120.35147793606949
39,TRP,8.76130370086025,,0,0,0,8.76130370086025,5.170909065617717,,0,0,0,5.170909065617717,176.4335480316184,,0,0,0,176.4335480316184,56.71885260636031,,0,0,0,56.71885260636031,29.823888856010658,,0,0,0,29.823888856010658,123.8937131151071,,0,0,0,123.8937131151071
40,TYR,9.054768164002663,,0,0,0,9.054768164002663,5.080140018703519,,0,0,0,5.080140018703519,174.64361307591298,,0,0,0,174.64361307591298,57.11688753977134,,0,0,0,57.11688753977134,40.98841301094461,,0,0,0,40.98841301094461,119.42308081601176,,0,0,0,119.42308081601176
41,ALA,8.003590470418471,,0,0,0,8.003590470418471,5.940120563736263,,0,0,0,5.940120563736263,175.22188413016428,,0,0,0,175.22188413016428,51.36337988541459,,0,0,0,51.36337988541459,23.34592564170829,,0,0,0,23.34592564170829,120.90494116800977,,0,0,0,120.90494116800977
42,LEU,8.932635557092908,,0,0,0,8.932635557092908,5.271696333166834,,0,0,0,5.271696333166834,174.95649731081696,,0,0,0,174.95649731081696,53.40848222961483,,0,0,0,53.40848222961483,45.16561106732712,,0,0,0,45.16561106732712,123.23478671285936,,0,0,0,123.23478671285936
43,LEU,9.502745706382505,,0,0,0,9.502745706382505,5.179200736369186,,0,0,0,5.179200736369186,174.6812227712676,,0,0,0,174.6812227712676,53.80781537665668,,0,0,0,53.80781537665668,44.44235447263292,,0,0,0,44.44235447263292,130.26293962949273,,0,0,0,130.26293962949273
44,MET,9.14945359998335,,0,0,0,9.14945359998335,4.192408776229326,,0,0,0,4.192408776229326,173.44574919433902,,0,0,0,173.44574919433902,54.63563159549339,,0,0,0,54.63563159549339,37.20517399096459,,0,0,0,37.20517399096459,124.23477098572538,,0,0,0,124.23477098572538
45,ASP,7.885980423187923,,0,0,0,7.885980423187923,5.241530598518149,,0,0,0,5.241530598518149,175.9615629633755,,0,0,0,175.9615629633755,53.2364710972805,,0,0,0,53.2364710972805,42.15823476330336,,0,0,0,42.15823476330336,123.11846707772783,,0,0,0,123.11846707772783
46,ILE,8.899582224558776,,0,0,0,8.899582224558776,4.713928207897657,,0,0,0,4.713928207897657,173.29103640758686,,0,0,0,173.29103640758686,57.15201397292708,,0,0,0,57.15201397292708,41.89792146727717,,0,0,0,41.89792146727717,122.48985332904873,,0,0,0,122.48985332904873
47,PRO,,,0,0,0,,4.393561997441448,,0,0,0,4.393561997441448,177.98762429029304,,0,0,0,177.98762429029304,63.214356198651345,,0,0,0,63.214356198651345,31.70230047782773,,0,0,0,31.70230047782773,,,0,0,0,
48,ALA,8.707538914840715,,0,0,0,8.707538914840715,3.756284482686758,,0,0,0,3.756284482686758,179.36646348352758,,0,0,0,179.36646348352758,54.87219709143079,,0,0,0,54.87219709143079,18.46559536714952,,0,0,0,18.46559536714952,128.4878305092352,,0,0,0,128.4878305092352
49,GLU,8.799619767421468,,0,0,0,8.799619767421468,4.074172004897879,,0,0,0,4.074172004897879,179.4445710132978,,0,0,0,179.4445710132978,58.87353712864358,,0,0,0,58.87353712864358,28.874699231507382,,0,0,0,28.874699231507382,116.08085833568099,,0,0,0,116.08085833568099
50,LYS,8.042930209967809,,0,0,0,8.042930209967809,4.107023585697636,,0,0,0,4.107023585697636,177.54855066521256,,0,0,0,177.54855066521256,58.063633801609505,,0,0,0,58.063633801609505,31.6153987970252,,0,0,0,31.6153987970252,119.93272240019981,,0,0,0,119.93272240019981
51,ILE,7.065520223659673,,0,0,0,7.065520223659673,4.493882315773116,,0,0,0,4.493882315773116,175.4766206674825,,0,0,0,175.4766206674825,60.3429649950716,,0,0,0,60.3429649950716,37.6427493989899,,0,0,0,37.6427493989899,110.72987990674325,,0,0,0,110.72987990674325
52,GLY,7.749186344144745,,0,0,0,7.749186344144745,3.9407517130119882,,0,0,0,3.9407517130119882,174.67249184254635,,0,0,0,174.67249184254635,45.63378745878566,,0,0,0,45.63378745878566,,,0,0,0,,108.78712688725719,,0,0,0,108.78712688725719
53,ILE,7.731764236419137,,0,0,0,7.731764236419137,4.078402140429016,,0,0,0,4.078402140429016,175.46776347792763,,0,0,0,175.46776347792763,60.631828364846264,,0,0,0,60.631828364846264,38.27047966461871,,0,0,0,38.27047966461871,122.30256814623155,,0,0,0,122.30256814623155
54,ASN,8.556245905083806,,0,0,0,8.556245905083806,4.664420077283828,,0,0,0,4.664420077283828,174.89363716955822,,0,0,0,174.89363716955822,53.55079620374625,,0,0,0,53.55079620374625,38.68456477373182,,0,0,0,38.68456477373182,126.87539664769676,,0,0,0,126.87539664769676
55,GLY,8.237353153108003,,0,0,0,8.237353153108003,4.018009598465423,,0,0,0,4.018009598465423,173.43289601868688,,0,0,0,173.43289601868688,45.23243875393496,,0,0,0,45.23243875393496,,,0,0,0,,110.0858540966034,,0,0,0,110.0858540966034
56,ASP,8.383614683494283,,0,0,0,8.383614683494283,4.5832288036130535,,0,0,0,4.5832288036130535,176.1917285249362,,0,0,0,176.1917285249362,54.39730334043179,,0,0,0,54.39730334043179,40.861958749422804,,0,0,0,40.861958749422804,120.10806258670775,,0,0,0,120.10806258670775
57,LYS,8.054540203557552,,0,0,0,8.054540203557552,4.289234722533022,,0,0,0,4.289234722533022,175.6971673163947,,0,0,0,175.6971673163947,56.351275450349654,,0,0,0,56.351275450349654,33.32225403220114,,0,0,0,33.32225403220114,120.41492633403819,,0,0,0,120.41492633403819
58,ARG,8.39901526863692,,0,0,0,8.39901526863692,4.881249707947608,,0,0,0,4.881249707947608,175.71003115414587,,0,0,0,175.71003115414587,55.57236025424575,,0,0,0,55.57236025424575,31.64679474114219,,0,0,0,31.64679474114219,121.64395002421467,,0,0,0,121.64395002421467
59,VAL,8.891435216772116,,0,0,0,8.891435216772116,4.500306461782661,,0,0,0,4.500306461782661,174.79636526565656,,0,0,0,174.79636526565656,60.008563597191696,,0,0,0,60.008563597191696,35.06256708123543,,0,0,0,35.06256708123543,119.81425192924853,,0,0,0,119.81425192924853
60,ASP,8.632757312703962,,0,0,0,8.632757312703962,5.2830544305860805,,0,0,0,5.2830544305860805,175.96237675464536,,0,0,0,175.96237675464536,54.24527891419137,,0,0,0,54.24527891419137,41.306186721189924,,0,0,0,41.306186721189924,125.71298490133756,,0,0,0,125.71298490133756
61,VAL,8.925822524125875,,0,0,0,8.925822524125875,5.279287331901431,,0,0,0,5.279287331901431,173.84792022712844,,0,0,0,173.84792022712844,58.624092283261184,,0,0,0,58.624092283261184,35.64746163509824,,0,0,0,35.64746163509824,117.55875774889554,,0,0,0,117.55875774889554
62,ILE,9.035844304384504,,0,0,0,9.035844304384504,4.954264604650906,,0,0,0,4.954264604650906,174.58127626014542,,0,0,0,174.58127626014542,58.60853530707626,,0,0,0,58.60853530707626,41.03626788261183,,0,0,0,41.03626788261183,119.36877989678655,,0,0,0,119.36877989678655
63,ASP,9.09330337014652,,0,0,0,9.09330337014652,5.753584770018869,,0,0,0,5.753584770018869,176.02313233019203,,0,0,0,176.02313233019203,53.66636149001554,,0,0,0,53.66636149001554,43.09152026787657,,0,0,0,43.09152026787657,127.43162182982573,,0,0,0,127.43162182982573
64,LEU,9.367724945204795,,0,0,0,9.367724945204795,5.141825166494616,,0,0,0,5.141825166494616,175.06352257686203,,0,0,0,175.06352257686203,53.21819994820735,,0,0,0,53.21819994820735,46.53532489277945,,0,0,0,46.53532489277945,122.7691780994339,,0,0,0,122.7691780994339
65,LYS,8.484464947102897,,0,0,0,8.484464947102897,3.728877687271062,,0,0,0,3.728877687271062,175.91996772833278,,0,0,0,175.91996772833278,55.784591444966146,,0,0,0,55.784591444966146,32.71921774831835,,0,0,0,32.71921774831835,122.46337399169164,,0,0,0,122.46337399169164
66,VAL,8.369452937845487,,0,0,0,8.369452937845487,4.466063352697303,,0,0,0,4.466063352697303,174.55949097861583,,0,0,0,174.55949097861583,59.44580846886447,,0,0,0,59.44580846886447,35.29240739996115,,0,0,0,35.29240739996115,118.98562631792652,,0,0,0,118.98562631792652
67,GLN,8.18016083065823,,0,0,0,8.18016083065823,4.519253150654901,,0,0,0,4.519253150654901,175.8464593096792,,0,0,0,175.8464593096792,54.61142640217005,,0,0,0,54.61142640217005,28.755655673248974,,0,0,0,28.755655673248974,121.44292621532355,,0,0,0,121.44292621532355
68,PRO,,,0,0,0,,4.43579870505328,,0,0,0,4.43579870505328,179.06750981979687,,0,0,0,179.06750981979687,65.92278990693195,,0,0,0,65.92278990693195,31.729741978904432,,0,0,0,31.729741978904432,,,0,0,0,
69,GLU,9.422624001609503,,0,0,0,9.422624001609503,4.12625917512765,,0,0,0,4.12625917512765,177.7076395591797,,0,0,0,177.7076395591797,59.00132811511266,,0,0,0,59.00132811511266,29.1789619013431,,0,0,0,29.1789619013431,117.09412185638251,,0,0,0,117.09412185638251
70,LEU,7.7179162149850145,,0,0,0,7.7179162149850145,4.292453618267843,,0,0,0,4.292453618267843,178.74698672460872,,0,0,0,178.74698672460872,56.017137120129874,,0,0,0,56.017137120129874,42.53000821930292,,0,0,0,42.53000821930292,119.36205582356531,,0,0,0,119.36205582356531
71,VAL,7.947669825824176,,0,0,0,7.947669825824176,3.476792210941837,,0,0,0,3.476792210941837,177.41982709354534,,0,0,0,177.41982709354534,66.93965967515263,,0,0,0,66.93965967515263,31.46165127845488,,0,0,0,31.46165127845488,119.94176796956377,,0,0,0,119.94176796956377
72,GLY,8.744818501859251,,0,0,0,8.744818501859251,3.826008023518148,,0,0,0,3.826008023518148,176.1680213424631,,0,0,0,176.1680213424631,47.187749014518815,,0,0,0,47.187749014518815,,,0,0,0,,107.30003365878565,,0,0,0,107.30003365878565
73,SER,7.96823276997447,,0,0,0,7.96823276997447,4.375381449142524,,0,0,0,4.375381449142524,177.00331534467753,,0,0,0,177.00331534467753,60.93796761834832,,0,0,0,60.93796761834832,63.17912584636474,,0,0,0,63.17912584636474,117.16765937464203,,0,0,0,117.16765937464203
74,LEU,8.268990040581642,,0,0,0,8.268990040581642,4.113776811122211,,0,0,0,4.113776811122211,179.27374431654457,,0,0,0,179.27374431654457,57.321346864757466,,0,0,0,57.321346864757466,42.15348830851926,,0,0,0,42.15348830851926,122.67621568055833,,0,0,0,122.67621568055833
75,ARG,8.158815147913199,,0,0,0,8.158815147913199,4.057171763719614,,0,0,0,4.057171763719614,177.1683519934954,,0,0,0,177.1683519934954,58.19145458836164,,0,0,0,58.19145458836164,30.138843504945054,,0,0,0,30.138843504945054,117.90486353720169,,0,0,0,117.90486353720169
76,LYS,7.640879922943722,,0,0,0,7.640879922943722,4.234653751731602,,0,0,0,4.234653751731602,177.22185495756466,,0,0,0,177.22185495756466,56.965053730419584,,0,0,0,56.965053730419584,32.51237463901654,,0,0,0,32.51237463901654,116.93982947518593,,0,0,0,116.93982947518593
77,LYS,7.523694355827505,,0,0,0,7.523694355827505,4.494614504387279,,0,0,0,4.494614504387279,174.25465659740814,,0,0,0,174.25465659740814,54.143578590903545,,0,0,0,54.143578590903545,32.12484704572095,,0,0,0,32.12484704572095,121.4246462116217,,0,0,0,121.4246462116217
78,PRO,,,0,0,0,,4.208937807220558,,0,0,0,4.208937807220558,177.21014862278278,,0,0,0,177.21014862278278,63.795238933061384,,0,0,0,63.795238933061384,31.558400017404818,,0,0,0,31.558400017404818,,,0,0,0,
79,GLY,8.335630746364746,,0,0,0,8.335630746364746,3.9666269845376845,,0,0,0,3.9666269845376845,173.16511506773782,,0,0,0,173.16511506773782,45.30357902944278,,0,0,0,45.30357902944278,,,0,0,0,,109.94420386469086,,0,0,0,109.94420386469086
80,ILE,7.328413223654123,,0,0,0,7.328413223654123,4.893612548751249,,0,0,0,4.893612548751249,174.87213040012765,,0,0,0,174.87213040012765,60.11571331682207,,0,0,0,60.11571331682207,38.60598226425241,,0,0,0,38.60598226425241,121.38742572555778,,0,0,0,121.38742572555778
81,TYR,9.325714550999,,0,0,0,9.325714550999,5.072817814885115,,0,0,0,5.072817814885115,173.9578680775891,,0,0,0,173.9578680775891,54.76893913437673,,0,0,0,54.76893913437673,41.806512757914305,,0,0,0,41.806512757914305,126.05937241576757,,0,0,0,126.05937241576757
82,PRO,,,0,0,0,,4.540686756238206,,0,0,0,4.540686756238206,175.85595837156734,,0,0,0,175.85595837156734,63.23344771917527,,0,0,0,63.23344771917527,32.0135467553058,,0,0,0,32.0135467553058,,,0,0,0,
83,ALA,8.118078607814407,,0,0,0,8.118078607814407,4.327360184121434,,0,0,0,4.327360184121434,177.17036157625708,,0,0,0,177.17036157625708,52.63296201235431,,0,0,0,52.63296201235431,19.28907077611833,,0,0,0,19.28907077611833,124.08891062281052,,0,0,0,124.08891062281052
84,TYR,8.477937395387944,,0,0,0,8.477937395387944,4.620202301287601,,0,0,0,4.620202301287601,175.90251896394716,,0,0,0,175.90251896394716,58.031319890165385,,0,0,0,58.031319890165385,39.56138883704074,,0,0,0,39.56138883704074,122.12957593578643,,0,0,0,122.12957593578643
85,HIS,8.300125706709956,,0,0,0,8.300125706709956,3.867447520854146,,0,0,0,3.867447520854146,174.5748922502775,,0,0,0,174.5748922502775,57.34596967545787,,0,0,0,57.34596967545787,28.13183050967921,,0,0,0,28.13183050967921,123.6066238520202,,0,0,0,123.6066238520202
86,MET,8.337628520840271,,0,0,0,8.337628520840271,4.155671043911644,,0,0,0,4.155671043911644,175.3790095853147,,0,0,0,175.3790095853147,54.17253847692307,,0,0,0,54.17253847692307,33.167090644955046,,0,0,0,33.167090644955046,118.46789969118659,,0,0,0,118.46789969118659
87,ASN,8.437287135353536,,0,0,0,8.437287135353536,4.671236673271173,,0,0,0,4.671236673271173,176.61819515407925,,0,0,0,176.61819515407925,53.10601334912865,,0,0,0,53.10601334912865,39.371871732267735,,0,0,0,39.371871732267735,120.31515657142302,,0,0,0,120.31515657142302
88,LYS,8.824641055988454,,0,0,0,8.824641055988454,4.172420164535464,,0,0,0,4.172420164535464,177.24838972706738,,0,0,0,177.24838972706738,58.55171457688978,,0,0,0,58.55171457688978,32.36882408008658,,0,0,0,32.36882408008658,124.83700315429016,,0,0,0,124.83700315429016
89,GLU,8.464174956959706,,0,0,0,8.464174956959706,4.245482098573649,,0,0,0,4.245482098573649,177.41530986432457,,0,0,0,177.41530986432457,58.043805743278945,,0,0,0,58.043805743278945,29.970817375402376,,0,0,0,29.970817375402376,117.47757736011766,,0,0,0,117.47757736011766