RESNUM,RESNAME,H_X,H_Y,H_BEST_REF_SCORE,H_BEST_REF_COV,H_BEST_REF_MATCH,H_UCBShift,HA_X,HA_Y,HA_BEST_REF_SCORE,HA_BEST_REF_COV,HA_BEST_REF_MATCH,HA_UCBShift,C_X,C_Y,C_BEST_REF_SCORE,C_BEST_REF_COV,C_BEST_REF_MATCH,C_UCBShift,CA_X,CA_Y,CA_BEST_REF_SCORE,CA_BEST_REF_COV,CA_BEST_REF_MATCH,CA_UCBShift,CB_X,CB_Y,CB_BEST_REF_SCORE,CB_BEST_REF_COV,CB_BEST_REF_MATCH,CB_UCBShift,N_X,N_Y,N_BEST_REF_SCORE,N_BEST_REF_COV,N_BEST_REF_MATCH,N_UCBShift
1,VAL,8.283773007381507,,0,0,0,8.283773007381507,4.130386900158175,,0,0,0,4.130386900158175,174.9131832922189,,0,0,0,174.9131832922189,61.95849593779554,,0,0,0,61.95849593779554,32.591384594011544,,0,0,0,32.591384594011544,120.94862102167832,,0,0,0,120.94862102167832
2,PHE,8.191657577200578,,0,0,0,8.191657577200578,4.658172674769674,,0,0,0,4.658172674769674,175.14959980372961,,0,0,0,175.14959980372961,57.73372110734821,,0,0,0,57.73372110734821,40.37950004514375,,0,0,0,40.37950004514375,123.83107240253635,,0,0,0,123.83107240253635
3,ARG,8.342291885786436,,0,0,0,8.342291885786436,4.467784176012876,,0,0,0,4.467784176012876,176.1771412910867,,0,0,0,176.1771412910867,56.05298043237873,,0,0,0,56.05298043237873,30.63446380901321,,0,0,0,30.63446380901321,123.45225141092241,,0,0,0,123.45225141092241
4,ALA,8.510628934659785,,0,0,0,8.510628934659785,4.382093960606061,,0,0,0,4.382093960606061,177.75262049050394,,0,0,0,177.75262049050394,52.62127112315462,,0,0,0,52.62127112315462,19.345327775002776,,0,0,0,19.345327775002776,126.31220996958042,,0,0,0,126.31220996958042
5,ASP,8.395402876140526,,0,0,0,8.395402876140526,4.759249153008103,,0,0,0,4.759249153008103,176.55996881603397,,0,0,0,176.55996881603397,54.43594494188589,,0,0,0,54.43594494188589,40.994817243101345,,0,0,0,40.994817243101345,120.30976699047065,,0,0,0,120.30976699047065
6,PHE,8.11521197938728,,0,0,0,8.11521197938728,4.494805006704406,,0,0,0,4.494805006704406,176.29281431547898,,0,0,0,176.29281431547898,58.15415858826729,,0,0,0,58.15415858826729,39.436563533333334,,0,0,0,39.436563533333334,119.53208325753135,,0,0,0,119.53208325753135
7,LEU,7.936834876651127,,0,0,0,7.936834876651127,4.582789606715507,,0,0,0,4.582789606715507,177.6252549038073,,0,0,0,177.6252549038073,55.29362391637252,,0,0,0,55.29362391637252,42.116183176728825,,0,0,0,42.116183176728825,119.97228705941836,,0,0,0,119.97228705941836
8,SER,8.058138576606726,,0,0,0,8.058138576606726,4.477458479026529,,0,0,0,4.477458479026529,174.88601208610277,,0,0,0,174.88601208610277,59.056022610089904,,0,0,0,59.056022610089904,63.76656309418359,,0,0,0,63.76656309418359,114.31863781651681,,0,0,0,114.31863781651681
9,GLU,8.286370274264623,,0,0,0,8.286370274264623,4.315654306812632,,0,0,0,4.315654306812632,176.97948725806415,,0,0,0,176.97948725806415,56.645347295482296,,0,0,0,56.645347295482296,29.74980774933955,,0,0,0,29.74980774933955,120.5381005506549,,0,0,0,120.5381005506549
10,LEU,7.799874548268399,,0,0,0,7.799874548268399,4.334113086108337,,0,0,0,4.334113086108337,176.73207179012653,,0,0,0,176.73207179012653,55.05408834010434,,0,0,0,55.05408834010434,41.98989110400711,,0,0,0,41.98989110400711,120.20648695945721,,0,0,0,120.20648695945721
11,ASP,8.13336299067044,,0,0,0,8.13336299067044,4.598689152775003,,0,0,0,4.598689152775003,175.41032906606728,,0,0,0,175.41032906606728,54.03678880801976,,0,0,0,54.03678880801976,40.694099146509046,,0,0,0,40.694099146509046,121.16175492421468,,0,0,0,121.16175492421468
12,ALA,7.973801793783993,,0,0,0,7.973801793783993,4.5000996445831944,,0,0,0,4.5000996445831944,175.49336089457765,,0,0,0,175.49336089457765,50.29030111118326,,0,0,0,50.29030111118326,18.51655754667555,,0,0,0,18.51655754667555,126.08968878881119,,0,0,0,126.08968878881119
13,PRO,,,0,0,0,,4.498384368212343,,0,0,0,4.498384368212343,176.0575638589355,,0,0,0,176.0575638589355,62.688739742507494,,0,0,0,62.688739742507494,31.816888764335665,,0,0,0,31.816888764335665,,,0,0,0,
14,ALA,8.321628729426129,,0,0,0,8.321628729426129,4.242052878626929,,0,0,0,4.242052878626929,177.52728627655122,,0,0,0,177.52728627655122,52.299838258363856,,0,0,0,52.299838258363856,19.004647263125765,,0,0,0,19.004647263125765,126.34936754116994,,0,0,0,126.34936754116994
15,GLN,8.333223256227107,,0,0,0,8.333223256227107,4.3629794514790765,,0,0,0,4.3629794514790765,175.77855671804306,,0,0,0,175.77855671804306,55.54738459733045,,0,0,0,55.54738459733045,29.70668677969253,,0,0,0,29.70668677969253,121.32659617642358,,0,0,0,121.32659617642358
16,ALA,8.293079167382617,,0,0,0,8.293079167382617,4.230060404090354,,0,0,0,4.230060404090354,177.567785729354,,0,0,0,177.567785729354,52.60904802297147,,0,0,0,52.60904802297147,19.016353373398825,,0,0,0,19.016353373398825,124.7829329157398,,0,0,0,124.7829329157398
17,GLY,8.196628322899324,,0,0,0,8.196628322899324,3.988563465870241,,0,0,0,3.988563465870241,173.44377437597402,,0,0,0,173.44377437597402,45.184753974558774,,0,0,0,45.184753974558774,,,0,0,0,,109.71633325835275,,0,0,0,109.71633325835275
18,THR,8.34959042998668,,0,0,0,8.34959042998668,4.312404844882894,,0,0,0,4.312404844882894,174.4016873828782,,0,0,0,174.4016873828782,62.1748236580919,,0,0,0,62.1748236580919,69.58278416648352,,0,0,0,69.58278416648352,114.75881891435786,,0,0,0,114.75881891435786
19,GLU,8.480944843073592,,0,0,0,8.480944843073592,4.127003224056499,,0,0,0,4.127003224056499,176.14961169451104,,0,0,0,176.14961169451104,57.19507252486957,,0,0,0,57.19507252486957,29.12616423306138,,0,0,0,29.12616423306138,121.90529084360085,,0,0,0,121.90529084360085
20,SER,8.151889502708404,,0,0,0,8.151889502708404,4.5209645241480745,,0,0,0,4.5209645241480745,174.58632385785882,,0,0,0,174.58632385785882,58.22915039950605,,0,0,0,58.22915039950605,63.535437780147625,,0,0,0,63.535437780147625,113.75287328030304,,0,0,0,113.75287328030304
21,ALA,8.2082143005772,,0,0,0,8.2082143005772,4.352502823201799,,0,0,0,4.352502823201799,177.51470367923744,,0,0,0,177.51470367923744,52.511571528249526,,0,0,0,52.511571528249526,18.700496745548897,,0,0,0,18.700496745548897,124.86140563563659,,0,0,0,124.86140563563659
22,VAL,7.826233916361415,,0,0,0,7.826233916361415,4.353200590201465,,0,0,0,4.353200590201465,176.7484361755467,,0,0,0,176.7484361755467,61.943430551992456,,0,0,0,61.943430551992456,32.18571002069042,,0,0,0,32.18571002069042,118.15767568162393,,0,0,0,118.15767568162393
23,SER,8.185988754489955,,0,0,0,8.185988754489955,4.5318409778166275,,0,0,0,4.5318409778166275,175.34614092139526,,0,0,0,175.34614092139526,58.33752604756909,,0,0,0,58.33752604756909,63.73541734326784,,0,0,0,63.73541734326784,116.79134584798535,,0,0,0,116.79134584798535
24,GLY,8.302487156698858,,0,0,0,8.302487156698858,4.033488551540127,,0,0,0,4.033488551540127,174.84216052508603,,0,0,0,174.84216052508603,45.7932851968365,,0,0,0,45.7932851968365,,,0,0,0,,110.48957461454657,,0,0,0,110.48957461454657
25,VAL,7.941124516838716,,0,0,0,7.941124516838716,4.168194762573537,,0,0,0,4.168194762573537,176.4679613470141,,0,0,0,176.4679613470141,62.37921603629149,,0,0,0,62.37921603629149,32.093478694727494,,0,0,0,32.093478694727494,113.36528795028305,,0,0,0,113.36528795028305
26,GLU,8.55617347944833,,0,0,0,8.55617347944833,4.234915527680653,,0,0,0,4.234915527680653,177.0896259305694,,0,0,0,177.0896259305694,58.184902921839274,,0,0,0,58.184902921839274,29.482425088011986,,0,0,0,29.482425088011986,119.41426188747919,,0,0,0,119.41426188747919
27,GLY,8.430314638256188,,0,0,0,8.430314638256188,3.9791563838550337,,0,0,0,3.9791563838550337,174.26629725784773,,0,0,0,174.26629725784773,45.20347047483627,,0,0,0,45.20347047483627,,,0,0,0,,107.96037567449217,,0,0,0,107.96037567449217
28,LEU,7.192113035325786,,0,0,0,7.192113035325786,4.58770954584582,,0,0,0,4.58770954584582,175.0011450778721,,0,0,0,175.0011450778721,53.121970235847485,,0,0,0,53.121970235847485,41.81975985536686,,0,0,0,41.81975985536686,122.52467779596515,,0,0,0,122.52467779596515
29,PRO,,,0,0,0,,4.6773030744616495,,0,0,0,4.6773030744616495,170.93608864620936,,0,0,0,170.93608864620936,61.38941616687757,,0,0,0,61.38941616687757,31.169557481129978,,0,0,0,31.169557481129978,,,0,0,0,
30,PRO,,,0,0,0,,4.319014372338773,,0,0,0,4.319014372338773,177.89966358788433,,0,0,0,177.89966358788433,64.17298232667888,,0,0,0,64.17298232667888,31.48833483561439,,0,0,0,31.48833483561439,,,0,0,0,
31,GLY,8.744324176107225,,0,0,0,8.744324176107225,3.9653229384976134,,0,0,0,3.9653229384976134,173.26812023003663,,0,0,0,173.26812023003663,45.33511746258186,,0,0,0,45.33511746258186,,,0,0,0,,111.96174854664224,,0,0,0,111.96174854664224
32,LEU,7.814654351737151,,0,0,0,7.814654351737151,5.024457977600178,,0,0,0,5.024457977600178,175.74056314928404,,0,0,0,175.74056314928404,54.076813596597844,,0,0,0,54.076813596597844,43.63685618729049,,0,0,0,43.63685618729049,120.61199284007658,,0,0,0,120.61199284007658
33,ALA,8.182621628077479,,0,0,0,8.182621628077479,4.820056594338995,,0,0,0,4.820056594338995,174.49031560149297,,0,0,0,174.49031560149297,50.58373830209235,,0,0,0,50.58373830209235,22.67952064895105,,0,0,0,22.67952064895105,123.151810004662,,0,0,0,123.151810004662
34,LEU,8.643047986496837,,0,0,0,8.643047986496837,4.930023244927296,,0,0,0,4.930023244927296,175.13057067475856,,0,0,0,175.13057067475856,53.64730145555001,,0,0,0,53.64730145555001,45.62213873237318,,0,0,0,45.62213873237318,122.26194212384281,,0,0,0,122.26194212384281
35,LEU,9.205183049667,,0,0,0,9.205183049667,5.188309963647465,,0,0,0,5.188309963647465,175.4572421998113,,0,0,0,175.4572421998113,53.65275213553114,,0,0,0,53.65275213553114,42.662186671761575,,0,0,0,42.662186671761575,127.36961648999889,,0,0,0,127.36961648999889
36,VAL,9.291168623154622,,0,0,0,9.291168623154622,4.803903838256188,,0,0,0,4.803903838256188,176.1006587152237,,0,0,0,176.1006587152237,60.745515665634365,,0,0,0,60.745515665634365,33.177423036668884,,0,0,0,33.177423036668884,123.59871699723055,,0,0,0,123.59871699723055
37,VAL,9.39176352124542,,0,0,0,9.39176352124542,4.3296398003774,,0,0,0,4.3296398003774,175.18738205312465,,0,0,0,175.18738205312465,64.29875310039961,,0,0,0,64.29875310039961,31.081472693278943,,0,0,0,31.081472693278943,130.05375573114665,,0,0,0,130.05375573114665
38,LYS,8.978742191597291,,0,0,0,8.978742191597291,4.28748216982462,,0,0,0,4.28748216982462,176.62915641619492,,0,0,0,176.62915641619492,57.25970447831058,,0,0,0,57.25970447831058,33.64960711318127,,0,0,0,33.64960711318127,130.0194565917527,,0,0,0,130.0194565917527
39,ARG,8.09420653871684,,0,0,0,8.09420653871684,4.6242288504329006,,0,0,0,4.6242288504329006,174.61496441215454,,0,0,0,174.61496441215454,55.47966393310578,,0,0,0,55.47966393310578,33.68088814740259,,0,0,0,33.68088814740259,117.14289161501276,,0,0,0,117.14289161501276
40,GLY,8.50853825984571,,0,0,0,8.50853825984571,3.987679469022644,,0,0,0,3.987679469022644,173.57631086570098,,0,0,0,173.57631086570098,44.56643097244422,,0,0,0,44.56643097244422,,,0,0,0,,111.34639110559995,,0,0,0,111.34639110559995
41,PRO,,,0,0,0,,4.4307946532301035,,0,0,0,4.4307946532301035,177.19604087287712,,0,0,0,177.19604087287712,64.23995826173827,,0,0,0,64.23995826173827,32.07668434996115,,0,0,0,32.07668434996115,,,0,0,0,
42,ASN,8.48353616061161,,0,0,0,8.48353616061161,4.9112724626151625,,0,0,0,4.9112724626151625,175.47637361933064,,0,0,0,175.47637361933064,52.41476066859807,,0,0,0,52.41476066859807,38.20851171774892,,0,0,0,38.20851171774892,115.68738319046508,,0,0,0,115.68738319046508
43,ALA,7.776154503574204,,0,0,0,7.776154503574204,4.10672796948052,,0,0,0,4.10672796948052,178.7574474414419,,0,0,0,178.7574474414419,54.113835178826726,,0,0,0,54.113835178826726,18.465326044233546,,0,0,0,18.465326044233546,122.78385617287712,,0,0,0,122.78385617287712
44,GLY,8.964933097186147,,0,0,0,8.964933097186147,3.994868535606061,,0,0,0,3.994868535606061,174.68701070154845,,0,0,0,174.68701070154845,44.875428192790544,,0,0,0,44.875428192790544,,,0,0,0,,111.58986278107447,,0,0,0,111.58986278107447
45,SER,8.167949204206904,,0,0,0,8.167949204206904,4.308085924658674,,0,0,0,4.308085924658674,173.2601260774059,,0,0,0,173.2601260774059,59.682016998384945,,0,0,0,59.682016998384945,64.20785279694195,,0,0,0,64.20785279694195,117.4936226522755,,0,0,0,117.4936226522755
46,ARG,8.12754030922966,,0,0,0,8.12754030922966,5.001586463003663,,0,0,0,5.001586463003663,174.7308048864469,,0,0,0,174.7308048864469,54.916339083083585,,0,0,0,54.916339083083585,32.4885744528527,,0,0,0,32.4885744528527,122.01556431952491,,0,0,0,122.01556431952491
47,PHE,9.304067874941726,,0,0,0,9.304067874941726,4.874323462959262,,0,0,0,4.874323462959262,174.79244356320348,,0,0,0,174.79244356320348,56.19848507849373,,0,0,0,56.19848507849373,41.040160040542794,,0,0,0,41.040160040542794,123.56386649323454,,0,0,0,123.56386649323454
48,LEU,8.897169216350317,,0,0,0,8.897169216350317,4.616011005722056,,0,0,0,4.616011005722056,175.94924873265623,,0,0,0,175.94924873265623,55.1950861999223,,0,0,0,55.1950861999223,42.69900667212232,,0,0,0,42.69900667212232,125.82562440477855,,0,0,0,125.82562440477855
49,LEU,8.99088152089022,,0,0,0,8.99088152089022,4.658047313136863,,0,0,0,4.658047313136863,176.27890635419578,,0,0,0,176.27890635419578,54.16542953046398,,0,0,0,54.16542953046398,41.31527837659563,,0,0,0,41.31527837659563,125.56975847051282,,0,0,0,125.56975847051282
50,ASP,8.01422268035853,,0,0,0,8.01422268035853,4.793560204290154,,0,0,0,4.793560204290154,175.80789712251084,,0,0,0,175.80789712251084,53.897409519902325,,0,0,0,53.897409519902325,41.51414453646909,,0,0,0,41.51414453646909,122.47771723352758,,0,0,0,122.47771723352758
51,GLN,7.970877077916528,,0,0,0,7.970877077916528,4.5115831546953045,,0,0,0,4.5115831546953045,175.27534874441113,,0,0,0,175.27534874441113,54.959930441652794,,0,0,0,54.959930441652794,30.52998022970363,,0,0,0,30.52998022970363,118.98855502115661,,0,0,0,118.98855502115661
52,ALA,8.526735882550783,,0,0,0,8.526735882550783,4.2746159324286825,,0,0,0,4.2746159324286825,177.41991320777,,0,0,0,177.41991320777,54.29692662848263,,0,0,0,54.29692662848263,19.490850936047288,,0,0,0,19.490850936047288,123.40408646785437,,0,0,0,123.40408646785437
53,ILE,7.6170516394993895,,0,0,0,7.6170516394993895,5.097604178932179,,0,0,0,5.097604178932179,175.04950587161727,,0,0,0,175.04950587161727,60.1651196464591,,0,0,0,60.1651196464591,41.01521169953935,,0,0,0,41.01521169953935,116.48649597256633,,0,0,0,116.48649597256633
54,THR,9.165304584060385,,0,0,0,9.165304584060385,4.847204515179265,,0,0,0,4.847204515179265,173.58687998600843,,0,0,0,173.58687998600843,61.94547797092907,,0,0,0,61.94547797092907,70.86467616105561,,0,0,0,70.86467616105561,124.20336976685537,,0,0,0,124.20336976685537
55,SER,9.07420680886891,,0,0,0,9.07420680886891,4.907853189432789,,0,0,0,4.907853189432789,173.3648501545288,,0,0,0,173.3648501545288,57.75999514498834,,0,0,0,57.75999514498834,64.63769173615829,,0,0,0,64.63769173615829,122.7780025944833,,0,0,0,122.7780025944833
56,ALA,8.899956330580531,,0,0,0,8.899956330580531,5.232081162387613,,0,0,0,5.232081162387613,175.77310356390277,,0,0,0,175.77310356390277,50.04966197539683,,0,0,0,50.04966197539683,21.84064636893107,,0,0,0,21.84064636893107,126.75009023670773,,0,0,0,126.75009023670773
57,GLY,8.95079195923521,,0,0,0,8.95079195923521,4.183570970712621,,0,0,0,4.183570970712621,173.39089051284827,,0,0,0,173.39089051284827,46.52954083936064,,0,0,0,46.52954083936064,,,0,0,0,,109.49658791717172,,0,0,0,109.49658791717172
58,ARG,8.965973007087356,,0,0,0,8.965973007087356,4.175465013381063,,0,0,0,4.175465013381063,176.4651968316517,,0,0,0,176.4651968316517,56.77187202743923,,0,0,0,56.77187202743923,30.87223116151626,,0,0,0,30.87223116151626,120.40201271853147,,0,0,0,120.40201271853147
59,HIS,8.297529667049616,,0,0,0,8.297529667049616,4.641802377960928,,0,0,0,4.641802377960928,175.3876501631313,,0,0,0,175.3876501631313,55.22408711534577,,0,0,0,55.22408711534577,31.087959643523146,,0,0,0,31.087959643523146,120.59110334129204,,0,0,0,120.59110334129204
60,PRO,,,0,0,0,,4.1861144035575535,,0,0,0,4.1861144035575535,177.24784837612944,,0,0,0,177.24784837612944,64.35881224436675,,0,0,0,64.35881224436675,32.15203318984349,,0,0,0,32.15203318984349,,,0,0,0,
61,ASP,8.530568442979243,,0,0,0,8.530568442979243,4.693505929534354,,0,0,0,4.693505929534354,176.31068504605952,,0,0,0,176.31068504605952,54.2698894445277,,0,0,0,54.2698894445277,40.755766011033415,,0,0,0,40.755766011033415,116.23304545199245,,0,0,0,116.23304545199245
62,SER,7.706823874508825,,0,0,0,7.706823874508825,4.522488701320901,,0,0,0,4.522488701320901,174.29121728283937,,0,0,0,174.29121728283937,58.724604236874235,,0,0,0,58.724604236874235,64.22188411830392,,0,0,0,64.22188411830392,117.94814725879677,,0,0,0,117.94814725879677
63,ASP,8.540612616150517,,0,0,0,8.540612616150517,4.5641106501221,,0,0,0,4.5641106501221,176.41604267291598,,0,0,0,176.41604267291598,56.69344006129981,,0,0,0,56.69344006129981,41.8672906985903,,0,0,0,41.8672906985903,122.7587640980242,,0,0,0,122.7587640980242
64,ILE,8.704451074336774,,0,0,0,8.704451074336774,3.920491982778333,,0,0,0,3.920491982778333,174.13657088533688,,0,0,0,174.13657088533688,60.43915814087579,,0,0,0,60.43915814087579,38.16049233808969,,0,0,0,38.16049233808969,122.13515642612388,,0,0,0,122.13515642612388
65,PHE,8.589199496969698,,0,0,0,8.589199496969698,5.072308715978465,,0,0,0,5.072308715978465,174.75848519219116,,0,0,0,174.75848519219116,57.29104144114219,,0,0,0,57.29104144114219,39.373591385359084,,0,0,0,39.373591385359084,127.84233029008213,,0,0,0,127.84233029008213
66,LEU,8.535788258691309,,0,0,0,8.535788258691309,4.134738613414363,,0,0,0,4.134738613414363,175.77276358305028,,0,0,0,175.77276358305028,52.97452781704407,,0,0,0,52.97452781704407,40.995728007403706,,0,0,0,40.995728007403706,128.7212354077922,,0,0,0,128.7212354077922
67,ASP,7.774757331951382,,0,0,0,7.774757331951382,4.40748316087246,,0,0,0,4.40748316087246,174.8003996061383,,0,0,0,174.8003996061383,53.74479247676213,,0,0,0,53.74479247676213,39.92379290972361,,0,0,0,39.92379290972361,124.03330202415363,,0,0,0,124.03330202415363
68,ASP,7.92487271024531,,0,0,0,7.92487271024531,4.804560516156066,,0,0,0,4.804560516156066,177.22281030946277,,0,0,0,177.22281030946277,53.5951041479243,,0,0,0,53.5951041479243,43.429557783999336,,0,0,0,43.429557783999336,122.88366886408592,,0,0,0,122.88366886408592
69,VAL,8.437972277722277,,0,0,0,8.437972277722277,4.040808168870019,,0,0,0,4.040808168870019,176.6307869207515,,0,0,0,176.6307869207515,64.10499762761128,,0,0,0,64.10499762761128,32.00295171393606,,0,0,0,32.00295171393606,123.19611375261405,,0,0,0,123.19611375261405
70,THR,8.093447421206571,,0,0,0,8.093447421206571,4.362386130880231,,0,0,0,4.362386130880231,174.72367644415027,,0,0,0,174.72367644415027,62.487672211932505,,0,0,0,62.487672211932505,69.56879446106116,,0,0,0,69.56879446106116,109.9125922933622,,0,0,0,109.9125922933622
71,VAL,7.745813278909979,,0,0,0,7.745813278909979,4.116002315992341,,0,0,0,4.116002315992341,175.54795464623155,,0,0,0,175.54795464623155,61.95325201961372,,0,0,0,61.95325201961372,33.07459767062382,,0,0,0,33.07459767062382,125.02670350133755,,0,0,0,125.02670350133755
72,SER,8.725445141541792,,0,0,0,8.725445141541792,4.536679489266289,,0,0,0,4.536679489266289,174.7673881412421,,0,0,0,174.7673881412421,58.48960302389832,,0,0,0,58.48960302389832,64.57491154306804,,0,0,0,64.57491154306804,122.29461148097458,,0,0,0,122.29461148097458
73,ARG,8.87950357955378,,0,0,0,8.87950357955378,4.068498773101898,,0,0,0,4.068498773101898,176.52392580638252,,0,0,0,176.52392580638252,58.93109034321235,,0,0,0,58.93109034321235,30.532460536030634,,0,0,0,30.532460536030634,121.65470353167389,,0,0,0,121.65470353167389
74,ARG,7.799118959102009,,0,0,0,7.799118959102009,4.543011953546453,,0,0,0,4.543011953546453,175.38680540209236,,0,0,0,175.38680540209236,54.980834177877675,,0,0,0,54.980834177877675,31.025624438150736,,0,0,0,31.025624438150736,117.47605864470529,,0,0,0,117.47605864470529
75,HIS,8.77345047029082,,0,0,0,8.77345047029082,4.428063162248862,,0,0,0,4.428063162248862,174.18433063238427,,0,0,0,174.18433063238427,57.431950797985344,,0,0,0,57.431950797985344,31.580118269685872,,0,0,0,31.580118269685872,123.34914628861694,,0,0,0,123.34914628861694
76,ALA,8.671695123637473,,0,0,0,8.671695123637473,5.1580411286491294,,0,0,0,5.1580411286491294,174.96531955009436,,0,0,0,174.96531955009436,50.42186824163614,,0,0,0,50.42186824163614,22.888772749128652,,0,0,0,22.888772749128652,120.52145134224664,,0,0,0,120.52145134224664
77,GLU,8.90295998097458,,0,0,0,8.90295998097458,5.15822432912088,,0,0,0,5.15822432912088,175.01173269246308,,0,0,0,175.01173269246308,54.531814411038965,,0,0,0,54.531814411038965,32.82025958875569,,0,0,0,32.82025958875569,119.51026793306139,,0,0,0,119.51026793306139
78,PHE,9.528191583644134,,0,0,0,9.528191583644134,5.2888844420745915,,0,0,0,5.2888844420745915,175.0919744425408,,0,0,0,175.0919744425408,56.84375018277834,,0,0,0,56.84375018277834,40.18242251136086,,0,0,0,40.18242251136086,122.21269595210345,,0,0,0,122.21269595210345
79,ARG,9.387455211188811,,0,0,0,9.387455211188811,5.106558081573981,,0,0,0,5.106558081573981,175.14299227860474,,0,0,0,175.14299227860474,54.568262407081804,,0,0,0,54.568262407081804,32.2257385511877,,0,0,0,32.2257385511877,124.57463691734931,,0,0,0,124.57463691734931
80,LEU,8.93046048978799,,0,0,0,8.93046048978799,4.6556236578754575,,0,0,0,4.6556236578754575,175.87454701449104,,0,0,0,175.87454701449104,54.023247982556335,,0,0,0,54.023247982556335,42.09843430696526,,0,0,0,42.09843430696526,127.48711918080252,,0,0,0,127.48711918080252
81,GLU,8.917577097125097,,0,0,0,8.917577097125097,4.459772297707848,,0,0,0,4.459772297707848,176.45065572567432,,0,0,0,176.45065572567432,55.74362519075369,,0,0,0,55.74362519075369,32.262988747669,,0,0,0,32.262988747669,127.22666499896214,,0,0,0,127.22666499896214
82,ASN,9.327389781684982,,0,0,0,9.327389781684982,4.407703216278167,,0,0,0,4.407703216278167,174.57197717666222,,0,0,0,174.57197717666222,54.3598502051948,,0,0,0,54.3598502051948,38.0954546989011,,0,0,0,38.0954546989011,122.05463025215896,,0,0,0,122.05463025215896
83,ASN,8.479831414169164,,0,0,0,8.479831414169164,4.348370464424465,,0,0,0,4.348370464424465,173.85860784684203,,0,0,0,173.85860784684203,54.76789317990898,,0,0,0,54.76789317990898,38.176496358197355,,0,0,0,38.176496358197355,110.92223078124098,,0,0,0,110.92223078124098
84,GLU,7.976610444033744,,0,0,0,7.976610444033744,4.807523672943723,,0,0,0,4.807523672943723,174.75389684390055,,0,0,0,174.75389684390055,55.05089779499944,,0,0,0,55.05089779499944,32.202455736091686,,0,0,0,32.202455736091686,119.34077854084805,,0,0,0,119.34077854084805
85,PHE,9.112137733405484,,0,0,0,9.112137733405484,4.992471162626263,,0,0,0,4.992471162626263,174.95192030572207,,0,0,0,174.95192030572207,57.0477627481796,,0,0,0,57.0477627481796,40.6945173012321,,0,0,0,40.6945173012321,121.28080046674437,,0,0,0,121.28080046674437
86,ASN,9.239391965345765,,0,0,0,9.239391965345765,5.443628307187257,,0,0,0,5.443628307187257,174.99018135170382,,0,0,0,174.99018135170382,52.1929716978688,,0,0,0,52.1929716978688,40.719890096947495,,0,0,0,40.719890096947495,123.07070706572317,,0,0,0,123.07070706572317
87,VAL,9.181602958469309,,0,0,0,9.181602958469309,4.529452183039183,,0,0,0,4.529452183039183,174.6516789052392,,0,0,0,174.6516789052392,60.71179159797425,,0,0,0,60.71179159797425,32.868303826140526,,0,0,0,32.868303826140526,123.80241572333777,,0,0,0,123.80241572333777
88,VAL,9.066835407853258,,0,0,0,9.066835407853258,4.718362942646243,,0,0,0,4.718362942646243,175.326776191897,,0,0,0,175.326776191897,60.544175573448776,,0,0,0,60.544175573448776,34.56122211287601,,0,0,0,34.56122211287601,126.93440256314797,,0,0,0,126.93440256314797
89,ASP,8.813608914402264,,0,0,0,8.813608914402264,4.713829503119103,,0,0,0,4.713829503119103,176.84813607400378,,0,0,0,176.84813607400378,54.400475696947495,,0,0,0,54.400475696947495,41.726561865046065,,0,0,0,41.726561865046065,128.36440015770896,,0,0,0,128.36440015770896