RESNUM,RESNAME,H_X,H_Y,H_BEST_REF_SCORE,H_BEST_REF_COV,H_BEST_REF_MATCH,H_UCBShift,HA_X,HA_Y,HA_BEST_REF_SCORE,HA_BEST_REF_COV,HA_BEST_REF_MATCH,HA_UCBShift,C_X,C_Y,C_BEST_REF_SCORE,C_BEST_REF_COV,C_BEST_REF_MATCH,C_UCBShift,CA_X,CA_Y,CA_BEST_REF_SCORE,CA_BEST_REF_COV,CA_BEST_REF_MATCH,CA_UCBShift,CB_X,CB_Y,CB_BEST_REF_SCORE,CB_BEST_REF_COV,CB_BEST_REF_MATCH,CB_UCBShift,N_X,N_Y,N_BEST_REF_SCORE,N_BEST_REF_COV,N_BEST_REF_MATCH,N_UCBShift
1,MET,8.348978464418915,,0,0,0,8.348978464418915,4.342225052325452,,0,0,0,4.342225052325452,174.60282462900435,,0,0,0,174.60282462900435,55.13629573676879,,0,0,0,55.13629573676879,33.189682487451435,,0,0,0,33.189682487451435,120.74507091400821,,0,0,0,120.74507091400821
2,GLU,8.271633725446776,,0,0,0,8.271633725446776,4.456273207525807,,0,0,0,4.456273207525807,174.7982733151182,,0,0,0,174.7982733151182,56.13012706067266,,0,0,0,56.13012706067266,30.156421613092462,,0,0,0,30.156421613092462,122.57204845806972,,0,0,0,122.57204845806972
3,PHE,8.448526112831614,,0,0,0,8.448526112831614,4.854718063986015,,0,0,0,4.854718063986015,173.7146180860917,,0,0,0,173.7146180860917,55.75036538115218,,0,0,0,55.75036538115218,40.374685283977136,,0,0,0,40.374685283977136,121.02698677085692,,0,0,0,121.02698677085692
4,PRO,,,0,0,0,,4.41182902039072,,0,0,0,4.41182902039072,175.02889506583972,,0,0,0,175.02889506583972,62.71921599005439,,0,0,0,62.71921599005439,32.63240529801865,,0,0,0,32.63240529801865,,,0,0,0,
5,ASP,8.502530586202687,,0,0,0,8.502530586202687,4.909716684987235,,0,0,0,4.909716684987235,175.1966297769453,,0,0,0,175.1966297769453,53.83339168112998,,0,0,0,53.83339168112998,41.60058864057054,,0,0,0,41.60058864057054,119.67995397615718,,0,0,0,119.67995397615718
6,LEU,8.918311634709735,,0,0,0,8.918311634709735,5.096862743317794,,0,0,0,5.096862743317794,176.4192014341492,,0,0,0,176.4192014341492,55.06497590283605,,0,0,0,55.06497590283605,43.99861816055056,,0,0,0,43.99861816055056,124.57884546650571,,0,0,0,124.57884546650571
7,THR,8.767619005494506,,0,0,0,8.767619005494506,5.032417926506826,,0,0,0,5.032417926506826,172.35052510678764,,0,0,0,172.35052510678764,59.71563195727605,,0,0,0,59.71563195727605,70.79891131457987,,0,0,0,70.79891131457987,114.372431314541,,0,0,0,114.372431314541
8,VAL,8.270782819580418,,0,0,0,8.270782819580418,5.219999853324453,,0,0,0,5.219999853324453,174.44173556749362,,0,0,0,174.44173556749362,59.43804452043512,,0,0,0,59.43804452043512,35.000768002897104,,0,0,0,35.000768002897104,120.14631664106449,,0,0,0,120.14631664106449
9,GLU,8.812045914812964,,0,0,0,8.812045914812964,4.780910482733932,,0,0,0,4.780910482733932,174.7042145163725,,0,0,0,174.7042145163725,54.25126609577645,,0,0,0,54.25126609577645,33.67362282554667,,0,0,0,33.67362282554667,124.32163407872683,,0,0,0,124.32163407872683
10,ILE,8.558629790476191,,0,0,0,8.558629790476191,5.134778072727273,,0,0,0,5.134778072727273,175.53543197973138,,0,0,0,175.53543197973138,59.794326544810744,,0,0,0,59.794326544810744,39.423822048051946,,0,0,0,39.423822048051946,123.98426422907093,,0,0,0,123.98426422907093
11,LYS,8.793698254301253,,0,0,0,8.793698254301253,4.611985784704184,,0,0,0,4.611985784704184,175.1498647406871,,0,0,0,175.1498647406871,54.57214752223332,,0,0,0,54.57214752223332,35.63883853399933,,0,0,0,35.63883853399933,125.45817953073593,,0,0,0,125.45817953073593
12,GLY,8.088476043240094,,0,0,0,8.088476043240094,3.7984486236929738,,0,0,0,3.7984486236929738,172.11932348913308,,0,0,0,172.11932348913308,44.871331017504716,,0,0,0,44.871331017504716,,,0,0,0,,110.19716610424575,,0,0,0,110.19716610424575
13,PRO,,,0,0,0,,4.4963765796453545,,0,0,0,4.4963765796453545,176.82328511728826,,0,0,0,176.82328511728826,62.92029538537018,,0,0,0,62.92029538537018,32.44767013699634,,0,0,0,32.44767013699634,,,0,0,0,
14,ASP,8.761118853901653,,0,0,0,8.761118853901653,4.869667498556998,,0,0,0,4.869667498556998,175.37842561324788,,0,0,0,175.37842561324788,55.33252333550894,,0,0,0,55.33252333550894,41.47347338027528,,0,0,0,41.47347338027528,120.73415740488402,,0,0,0,120.73415740488402
15,VAL,7.542088105333555,,0,0,0,7.542088105333555,5.127976650715951,,0,0,0,5.127976650715951,175.36220580891333,,0,0,0,175.36220580891333,61.25480816184926,,0,0,0,61.25480816184926,34.17314657999778,,0,0,0,34.17314657999778,118.7771700024309,,0,0,0,118.7771700024309
16,VAL,8.928676888111887,,0,0,0,8.928676888111887,4.563552903873903,,0,0,0,4.563552903873903,174.63805965745365,,0,0,0,174.63805965745365,59.43687521394717,,0,0,0,59.43687521394717,35.26710810381285,,0,0,0,35.26710810381285,119.77243343651904,,0,0,0,119.77243343651904
17,GLY,8.601538815811967,,0,0,0,8.601538815811967,3.916619519985571,,0,0,0,3.916619519985571,174.1455340592241,,0,0,0,174.1455340592241,44.690969231956934,,0,0,0,44.690969231956934,,,0,0,0,,110.90511086975246,,0,0,0,110.90511086975246
18,VAL,8.338324811732711,,0,0,0,8.338324811732711,3.4844238766150513,,0,0,0,3.4844238766150513,176.67787770651572,,0,0,0,176.67787770651572,64.22165066709402,,0,0,0,64.22165066709402,31.820863213969364,,0,0,0,31.820863213969364,123.77952583600289,,0,0,0,123.77952583600289
19,ASN,9.064734630669331,,0,0,0,9.064734630669331,4.202517853740704,,0,0,0,4.202517853740704,174.33193623883338,,0,0,0,174.33193623883338,54.80545047392607,,0,0,0,54.80545047392607,37.36722644273504,,0,0,0,37.36722644273504,121.20148013258408,,0,0,0,121.20148013258408
20,LYS,7.726328884498834,,0,0,0,7.726328884498834,4.5264291333666336,,0,0,0,4.5264291333666336,175.68273276177712,,0,0,0,175.68273276177712,55.09918276437452,,0,0,0,55.09918276437452,33.47517050694861,,0,0,0,33.47517050694861,119.59789669777446,,0,0,0,119.59789669777446
21,LEU,8.317223716217116,,0,0,0,8.317223716217116,4.22884560994561,,0,0,0,4.22884560994561,176.20209838149628,,0,0,0,176.20209838149628,55.525834673715174,,0,0,0,55.525834673715174,42.10980886551781,,0,0,0,42.10980886551781,124.95682720405705,,0,0,0,124.95682720405705
22,ALA,8.982514428932179,,0,0,0,8.982514428932179,4.7342232598068605,,0,0,0,4.7342232598068605,175.65803901209347,,0,0,0,175.65803901209347,50.91239012609058,,0,0,0,50.91239012609058,22.285964287934288,,0,0,0,22.285964287934288,128.78691878721833,,0,0,0,128.78691878721833
23,GLU,8.386067934776335,,0,0,0,8.386067934776335,4.9454029096070595,,0,0,0,4.9454029096070595,175.21947951259295,,0,0,0,175.21947951259295,55.39453564834055,,0,0,0,55.39453564834055,31.650329708769007,,0,0,0,31.650329708769007,121.07165252097347,,0,0,0,121.07165252097347
24,TYR,8.754844368703518,,0,0,0,8.754844368703518,5.023094826284827,,0,0,0,5.023094826284827,174.1167816514541,,0,0,0,174.1167816514541,56.58674034865135,,0,0,0,56.58674034865135,42.280907531779334,,0,0,0,42.280907531779334,121.80087565542235,,0,0,0,121.80087565542235
25,GLU,9.050178025568876,,0,0,0,9.050178025568876,5.117479631107781,,0,0,0,5.117479631107781,175.63959676436895,,0,0,0,175.63959676436895,54.76911396526806,,0,0,0,54.76911396526806,32.689328673359974,,0,0,0,32.689328673359974,121.76642686425797,,0,0,0,121.76642686425797
26,VAL,9.29068888091353,,0,0,0,9.29068888091353,4.887757931701632,,0,0,0,4.887757931701632,175.20456727977577,,0,0,0,175.20456727977577,60.34317256854812,,0,0,0,60.34317256854812,32.71663288985459,,0,0,0,32.71663288985459,124.5772487000111,,0,0,0,124.5772487000111
27,HIS,9.19406384966145,,0,0,0,9.19406384966145,4.860329203774004,,0,0,0,4.860329203774004,174.88646267354866,,0,0,0,174.88646267354866,55.57868674129204,,0,0,0,55.57868674129204,30.14842679073704,,0,0,0,30.14842679073704,126.96830823492618,,0,0,0,126.96830823492618
28,VAL,9.277103665401263,,0,0,0,9.277103665401263,4.963811290093241,,0,0,0,4.963811290093241,174.73917457940394,,0,0,0,174.73917457940394,59.61550904183039,,0,0,0,59.61550904183039,33.386806076789874,,0,0,0,33.386806076789874,125.33979400574981,,0,0,0,125.33979400574981
29,LYS,8.97591918116883,,0,0,0,8.97591918116883,5.104682542912643,,0,0,0,5.104682542912643,174.84771461533467,,0,0,0,174.84771461533467,54.36769508535909,,0,0,0,54.36769508535909,36.522910278349435,,0,0,0,36.522910278349435,125.56318293994339,,0,0,0,125.56318293994339
30,ASN,8.825745823770674,,0,0,0,8.825745823770674,5.204132600965701,,0,0,0,5.204132600965701,175.13673789424462,,0,0,0,175.13673789424462,51.21134538749584,,0,0,0,51.21134538749584,39.489945813847264,,0,0,0,39.489945813847264,121.32508893598624,,0,0,0,121.32508893598624
31,LEU,8.819168295271396,,0,0,0,8.819168295271396,4.323629218303918,,0,0,0,4.323629218303918,177.7121397088134,,0,0,0,177.7121397088134,55.51045244817405,,0,0,0,55.51045244817405,42.00824214100344,,0,0,0,42.00824214100344,124.66407885233654,,0,0,0,124.66407885233654
32,GLY,8.53586703934954,,0,0,0,8.53586703934954,4.11237711546509,,0,0,0,4.11237711546509,174.26518781660008,,0,0,0,174.26518781660008,44.70644121268176,,0,0,0,44.70644121268176,,,0,0,0,,107.97226969790765,,0,0,0,107.97226969790765
33,GLY,8.369347158902208,,0,0,0,8.369347158902208,3.971685268303918,,0,0,0,3.971685268303918,173.75822564073704,,0,0,0,173.75822564073704,45.58662127404263,,0,0,0,45.58662127404263,,,0,0,0,,105.38075102997003,,0,0,0,105.38075102997003
34,ILE,7.2399847158896655,,0,0,0,7.2399847158896655,4.281725998429349,,0,0,0,4.281725998429349,176.01290895068266,,0,0,0,176.01290895068266,60.27086413729604,,0,0,0,60.27086413729604,39.17473791292041,,0,0,0,39.17473791292041,120.41027525585525,,0,0,0,120.41027525585525
35,GLY,8.548507573654124,,0,0,0,8.548507573654124,3.9230948091214346,,0,0,0,3.9230948091214346,173.23795825920192,,0,0,0,173.23795825920192,45.25280168428238,,0,0,0,45.25280168428238,,,0,0,0,,113.73326698512044,,0,0,0,113.73326698512044
36,VAL,8.878497033283383,,0,0,0,8.878497033283383,4.668707322516373,,0,0,0,4.668707322516373,174.7217463833944,,0,0,0,174.7217463833944,58.969648038100786,,0,0,0,58.969648038100786,33.124956222810525,,0,0,0,33.124956222810525,124.02913168408813,,0,0,0,124.02913168408813
37,PRO,,,0,0,0,,4.519364776678877,,0,0,0,4.519364776678877,176.72169159946722,,0,0,0,176.72169159946722,64.11146766739371,,0,0,0,64.11146766739371,32.27184261966922,,0,0,0,32.27184261966922,,,0,0,0,
38,SER,7.945508280724831,,0,0,0,7.945508280724831,5.110776005633256,,0,0,0,5.110776005633256,173.03412057050173,,0,0,0,173.03412057050173,57.491114810850256,,0,0,0,57.491114810850256,64.48625925828061,,0,0,0,64.48625925828061,112.5188175936952,,0,0,0,112.5188175936952
39,THR,8.950722626823177,,0,0,0,8.950722626823177,4.8019348498335,,0,0,0,4.8019348498335,172.39313643091907,,0,0,0,172.39313643091907,60.22845972323787,,0,0,0,60.22845972323787,69.83931465290266,,0,0,0,69.83931465290266,120.61558871547896,,0,0,0,120.61558871547896
40,LYS,8.730820196753246,,0,0,0,8.730820196753246,5.17362912961483,,0,0,0,5.17362912961483,176.03314209081472,,0,0,0,176.03314209081472,55.677871213947164,,0,0,0,55.677871213947164,33.82734852647908,,0,0,0,33.82734852647908,124.97572298371074,,0,0,0,124.97572298371074
41,VAL,9.114633107603508,,0,0,0,9.114633107603508,5.133342905916306,,0,0,0,5.133342905916306,175.14537782898768,,0,0,0,175.14537782898768,60.51362176132756,,0,0,0,60.51362176132756,33.77406451975802,,0,0,0,33.77406451975802,124.81231470170941,,0,0,0,124.81231470170941
42,ARG,9.200051296842048,,0,0,0,9.200051296842048,5.211764744250195,,0,0,0,5.211764744250195,174.5238169379676,,0,0,0,174.5238169379676,54.49466064501609,,0,0,0,54.49466064501609,34.66641582279942,,0,0,0,34.66641582279942,126.01642666285382,,0,0,0,126.01642666285382
43,VAL,8.587464206804306,,0,0,0,8.587464206804306,4.951885655738705,,0,0,0,4.951885655738705,174.49424527284938,,0,0,0,174.49424527284938,60.19301472093462,,0,0,0,60.19301472093462,33.83352353710734,,0,0,0,33.83352353710734,121.83963978924965,,0,0,0,121.83963978924965
44,TYR,9.380969663680764,,0,0,0,9.380969663680764,5.148013169624821,,0,0,0,5.148013169624821,174.71356804575424,,0,0,0,174.71356804575424,56.334267999045395,,0,0,0,56.334267999045395,41.619100088478184,,0,0,0,41.619100088478184,125.58673693045289,,0,0,0,125.58673693045289
45,ILE,8.975667282905983,,0,0,0,8.975667282905983,4.66389766966922,,0,0,0,4.66389766966922,176.87069741984683,,0,0,0,176.87069741984683,60.46479622905983,,0,0,0,60.46479622905983,39.49107498807304,,0,0,0,39.49107498807304,121.40774912784994,,0,0,0,121.40774912784994
46,ASN,9.794958556465756,,0,0,0,9.794958556465756,4.392667307470308,,0,0,0,4.392667307470308,175.03230140605504,,0,0,0,175.03230140605504,53.87767236962482,,0,0,0,53.87767236962482,36.98274337592962,,0,0,0,36.98274337592962,127.93518834996115,,0,0,0,127.93518834996115
47,GLY,8.590937855699856,,0,0,0,8.590937855699856,3.7878131986818735,,0,0,0,3.7878131986818735,174.00287137157287,,0,0,0,174.00287137157287,45.4882310032523,,0,0,0,45.4882310032523,,,0,0,0,,103.14487097425352,,0,0,0,103.14487097425352
48,THR,7.746200195016095,,0,0,0,7.746200195016095,4.615898685680985,,0,0,0,4.615898685680985,173.87819350562214,,0,0,0,173.87819350562214,61.88852584482184,,0,0,0,61.88852584482184,70.27468013081364,,0,0,0,70.27468013081364,118.16213542571317,,0,0,0,118.16213542571317
49,LEU,8.925045200333,,0,0,0,8.925045200333,3.8438122413752915,,0,0,0,3.8438122413752915,175.96160705452326,,0,0,0,175.96160705452326,56.79541582405373,,0,0,0,56.79541582405373,41.822876219458315,,0,0,0,41.822876219458315,129.04445768930515,,0,0,0,129.04445768930515
50,TYR,8.932402806682207,,0,0,0,8.932402806682207,4.5962332084970585,,0,0,0,4.5962332084970585,175.04739020174824,,0,0,0,175.04739020174824,58.93864469149184,,0,0,0,58.93864469149184,40.627168465856364,,0,0,0,40.627168465856364,130.0020939947053,,0,0,0,130.0020939947053
51,LYS,7.860529692174492,,0,0,0,7.860529692174492,4.2375339948662445,,0,0,0,4.2375339948662445,173.77878092313796,,0,0,0,173.77878092313796,55.070781485481184,,0,0,0,55.070781485481184,35.69014622481408,,0,0,0,35.69014622481408,117.67981812456433,,0,0,0,117.67981812456433
52,ASN,7.8127647868520365,,0,0,0,7.8127647868520365,5.42196314987235,,0,0,0,5.42196314987235,173.33989377546342,,0,0,0,173.33989377546342,52.31414067883228,,0,0,0,52.31414067883228,41.6892627012543,,0,0,0,41.6892627012543,119.15864877059607,,0,0,0,119.15864877059607
53,TRP,9.153254296375845,,0,0,0,9.153254296375845,4.80077974967255,,0,0,0,4.80077974967255,174.99623202029082,,0,0,0,174.99623202029082,56.64362549385059,,0,0,0,56.64362549385059,33.635513981296484,,0,0,0,33.635513981296484,121.15010206447441,,0,0,0,121.15010206447441
54,THR,8.523097706460208,,0,0,0,8.523097706460208,5.243098389427239,,0,0,0,5.243098389427239,173.75565803794538,,0,0,0,173.75565803794538,61.667625528293925,,0,0,0,61.667625528293925,69.97406161058942,,0,0,0,69.97406161058942,118.01988461668331,,0,0,0,118.01988461668331
55,VAL,9.237836423643024,,0,0,0,9.237836423643024,4.6868097236541235,,0,0,0,4.6868097236541235,174.65416002564103,,0,0,0,174.65416002564103,59.30444020811411,,0,0,0,59.30444020811411,35.416874695759795,,0,0,0,35.416874695759795,121.79254506217671,,0,0,0,121.79254506217671
56,SER,8.55836502930403,,0,0,0,8.55836502930403,5.432476954445554,,0,0,0,5.432476954445554,174.1696102328893,,0,0,0,174.1696102328893,56.821846471184365,,0,0,0,56.821846471184365,65.46084764035965,,0,0,0,65.46084764035965,117.61288567752803,,0,0,0,117.61288567752803
57,LEU,8.942499802475304,,0,0,0,8.942499802475304,4.750965730896881,,0,0,0,4.750965730896881,176.1432993048507,,0,0,0,176.1432993048507,54.20876391368631,,0,0,0,54.20876391368631,45.191437740981236,,0,0,0,45.191437740981236,124.08681643591963,,0,0,0,124.08681643591963
58,GLY,8.802745421711622,,0,0,0,8.802745421711622,4.108304887809413,,0,0,0,4.108304887809413,172.9571594381674,,0,0,0,172.9571594381674,44.48133435731491,,0,0,0,44.48133435731491,,,0,0,0,,111.15524237853812,,0,0,0,111.15524237853812
59,PRO,,,0,0,0,,4.166821555658231,,0,0,0,4.166821555658231,177.29010038979354,,0,0,0,177.29010038979354,64.17913054646465,,0,0,0,64.17913054646465,31.70360761914197,,0,0,0,31.70360761914197,,,0,0,0,
60,LYS,8.452181333727383,,0,0,0,8.452181333727383,3.9937466745226997,,0,0,0,3.9937466745226997,175.96612624654233,,0,0,0,175.96612624654233,58.04493897865468,,0,0,0,58.04493897865468,29.783547713414364,,0,0,0,29.783547713414364,116.89763775742591,,0,0,0,116.89763775742591
61,GLU,7.8457659435508935,,0,0,0,7.8457659435508935,4.381198572943723,,0,0,0,4.381198572943723,175.23717505924074,,0,0,0,175.23717505924074,56.76583093948274,,0,0,0,56.76583093948274,31.409610716339213,,0,0,0,31.409610716339213,121.58631288502609,,0,0,0,121.58631288502609
62,GLU,8.594375638206238,,0,0,0,8.594375638206238,5.216700231790432,,0,0,0,5.216700231790432,175.69205039650905,,0,0,0,175.69205039650905,54.9668972958486,,0,0,0,54.9668972958486,32.5187501967255,,0,0,0,32.5187501967255,123.13908725885781,,0,0,0,123.13908725885781
63,LYS,9.044186543956044,,0,0,0,9.044186543956044,4.632235636435787,,0,0,0,4.632235636435787,174.42358973514263,,0,0,0,174.42358973514263,54.863845725535576,,0,0,0,54.863845725535576,35.77817716610612,,0,0,0,35.77817716610612,125.34951713762905,,0,0,0,125.34951713762905
64,VAL,8.576613683294482,,0,0,0,8.576613683294482,4.461231802053502,,0,0,0,4.461231802053502,175.4190314721945,,0,0,0,175.4190314721945,61.35804749932845,,0,0,0,61.35804749932845,32.31929953943279,,0,0,0,32.31929953943279,123.94229411475747,,0,0,0,123.94229411475747
65,LEU,9.011577881973581,,0,0,0,9.011577881973581,4.531618895210346,,0,0,0,4.531618895210346,175.31327297404818,,0,0,0,175.31327297404818,53.13157238224553,,0,0,0,53.13157238224553,42.71392612893218,,0,0,0,42.71392612893218,129.26522888309466,,0,0,0,129.26522888309466
66,THR,8.447856222605173,,0,0,0,8.447856222605173,5.41106510961816,,0,0,0,5.41106510961816,174.25092793040292,,0,0,0,174.25092793040292,60.55965299512154,,0,0,0,60.55965299512154,70.42243141646686,,0,0,0,70.42243141646686,115.63987478848372,,0,0,0,115.63987478848372
67,PHE,9.042624746281497,,0,0,0,9.042624746281497,5.173070499017649,,0,0,0,5.173070499017649,173.11797151460206,,0,0,0,173.11797151460206,56.216121902380955,,0,0,0,56.216121902380955,41.8495753444833,,0,0,0,41.8495753444833,121.30159456594517,,0,0,0,121.30159456594517
68,SER,8.878742744511046,,0,0,0,8.878742744511046,5.437537758108558,,0,0,0,5.437537758108558,174.05225776738817,,0,0,0,174.05225776738817,56.83824563399933,,0,0,0,56.83824563399933,65.11667396100566,,0,0,0,65.11667396100566,116.75302860409036,,0,0,0,116.75302860409036
69,TRP,9.36031116083361,,0,0,0,9.36031116083361,5.881015238544791,,0,0,0,5.881015238544791,174.60266052365967,,0,0,0,174.60266052365967,55.77095081964147,,0,0,0,55.77095081964147,32.477429486990786,,0,0,0,32.477429486990786,125.8916933035853,,0,0,0,125.8916933035853
70,THR,8.635634173787324,,0,0,0,8.635634173787324,4.769813180924631,,0,0,0,4.769813180924631,172.22909712803306,,0,0,0,172.22909712803306,58.6899585039405,,0,0,0,58.6899585039405,70.08622070249196,,0,0,0,70.08622070249196,124.72195830743145,,0,0,0,124.72195830743145
71,PRO,,,0,0,0,,4.072784525238651,,0,0,0,4.072784525238651,176.35987253389945,,0,0,0,176.35987253389945,62.49513887090132,,0,0,0,62.49513887090132,31.305194474142525,,0,0,0,31.305194474142525,,,0,0,0,
72,THR,8.405538767671217,,0,0,0,8.405538767671217,4.493143906254856,,0,0,0,4.493143906254856,174.12581276552336,,0,0,0,174.12581276552336,61.89954628281163,,0,0,0,61.89954628281163,70.04912388327783,,0,0,0,70.04912388327783,112.9340083942724,,0,0,0,112.9340083942724
73,GLN,7.845877417049617,,0,0,0,7.845877417049617,4.585750049622599,,0,0,0,4.585750049622599,175.14748763777334,,0,0,0,175.14748763777334,54.90811027838273,,0,0,0,54.90811027838273,31.277822264729714,,0,0,0,31.277822264729714,120.5799016597125,,0,0,0,120.5799016597125
74,GLU,8.598621020396271,,0,0,0,8.598621020396271,4.353917237484737,,0,0,0,4.353917237484737,176.21378377447553,,0,0,0,176.21378377447553,56.686551831462985,,0,0,0,56.686551831462985,30.92185493807859,,0,0,0,30.92185493807859,119.95812528585859,,0,0,0,119.95812528585859
75,GLY,8.998732156598956,,0,0,0,8.998732156598956,4.133809847274948,,0,0,0,4.133809847274948,172.4656999990676,,0,0,0,172.4656999990676,44.27252054634255,,0,0,0,44.27252054634255,,,0,0,0,,109.0245247471584,,0,0,0,109.0245247471584
76,MET,8.46053918044733,,0,0,0,8.46053918044733,5.173411439493839,,0,0,0,5.173411439493839,175.93865262986458,,0,0,0,175.93865262986458,54.43286066812632,,0,0,0,54.43286066812632,32.670613408663556,,0,0,0,32.670613408663556,120.36691926849261,,0,0,0,120.36691926849261
77,TYR,9.383163926196024,,0,0,0,9.383163926196024,5.068349194483295,,0,0,0,5.068349194483295,174.12143041688313,,0,0,0,174.12143041688313,56.51967305666555,,0,0,0,56.51967305666555,41.77394189872905,,0,0,0,41.77394189872905,121.26615010119325,,0,0,0,121.26615010119325
78,ARG,9.173886532456432,,0,0,0,9.173886532456432,4.980145386946387,,0,0,0,4.980145386946387,174.7018746814186,,0,0,0,174.7018746814186,55.12850877171717,,0,0,0,55.12850877171717,32.5372856006771,,0,0,0,32.5372856006771,123.65760456789322,,0,0,0,123.65760456789322
79,ILE,9.188639025108225,,0,0,0,9.188639025108225,4.790653004928405,,0,0,0,4.790653004928405,174.8874247110778,,0,0,0,174.8874247110778,60.413467021117775,,0,0,0,60.413467021117775,39.19614763535908,,0,0,0,39.19614763535908,126.67234373043068,,0,0,0,126.67234373043068
80,ASN,9.00902354922855,,0,0,0,9.00902354922855,5.773998981690532,,0,0,0,5.773998981690532,174.30881964579862,,0,0,0,174.30881964579862,52.304940776978576,,0,0,0,52.304940776978576,42.10537572946498,,0,0,0,42.10537572946498,125.86595382569652,,0,0,0,125.86595382569652
81,ALA,9.109422208147409,,0,0,0,9.109422208147409,5.700117133311133,,0,0,0,5.700117133311133,175.91703350831392,,0,0,0,175.91703350831392,49.62277523242868,,0,0,0,49.62277523242868,22.535095063164615,,0,0,0,22.535095063164615,126.18189900754801,,0,0,0,126.18189900754801
82,THR,9.02759667926518,,0,0,0,9.02759667926518,5.704540047996447,,0,0,0,5.704540047996447,173.82191605582193,,0,0,0,173.82191605582193,59.375944738222884,,0,0,0,59.375944738222884,71.71975838565324,,0,0,0,71.71975838565324,114.19995539477743,,0,0,0,114.19995539477743
83,VAL,8.887125753568654,,0,0,0,8.887125753568654,5.149719095670996,,0,0,0,5.149719095670996,175.50910891592852,,0,0,0,175.50910891592852,59.02745261277611,,0,0,0,59.02745261277611,34.965349556926405,,0,0,0,34.965349556926405,120.46255810358531,,0,0,0,120.46255810358531
84,ASP,8.619188917293817,,0,0,0,8.619188917293817,4.3920630795787545,,0,0,0,4.3920630795787545,177.18928257343768,,0,0,0,177.18928257343768,54.875412923409925,,0,0,0,54.875412923409925,40.46442671436342,,0,0,0,40.46442671436342,124.18639985935177,,0,0,0,124.18639985935177
85,GLU,8.835153107348209,,0,0,0,8.835153107348209,3.981240260259186,,0,0,0,3.981240260259186,177.40692063794538,,0,0,0,177.40692063794538,58.921642943106896,,0,0,0,58.921642943106896,29.783404595260293,,0,0,0,29.783404595260293,118.1354348021534,,0,0,0,118.1354348021534
86,GLU,8.313928374153624,,0,0,0,8.313928374153624,4.222469092094016,,0,0,0,4.222469092094016,175.7793197548174,,0,0,0,175.7793197548174,56.18375989791875,,0,0,0,56.18375989791875,29.218449456082805,,0,0,0,29.218449456082805,116.6514043461705,,0,0,0,116.6514043461705
87,ASN,7.989105495609946,,0,0,0,7.989105495609946,4.38945598986014,,0,0,0,4.38945598986014,174.92402117602396,,0,0,0,174.92402117602396,54.00466665864691,,0,0,0,54.00466665864691,37.49840511858142,,0,0,0,37.49840511858142,117.88480127590188,,0,0,0,117.88480127590188
88,THR,7.9544061024753026,,0,0,0,7.9544061024753026,4.370780410445111,,0,0,0,4.370780410445111,175.1095610071484,,0,0,0,175.1095610071484,62.540814728110774,,0,0,0,62.540814728110774,69.83359048729048,,0,0,0,69.83359048729048,110.92010063723498,,0,0,0,110.92010063723498
89,VAL,8.234641848235098,,0,0,0,8.234641848235098,4.147644319663669,,0,0,0,4.147644319663669,174.61516077143412,,0,0,0,174.61516077143412,61.80532839221335,,0,0,0,61.80532839221335,33.152604240004436,,0,0,0,33.152604240004436,124.70169381077257,,0,0,0,124.70169381077257