RESNUM,RESNAME,H_X,H_Y,H_BEST_REF_SCORE,H_BEST_REF_COV,H_BEST_REF_MATCH,H_UCBShift,HA_X,HA_Y,HA_BEST_REF_SCORE,HA_BEST_REF_COV,HA_BEST_REF_MATCH,HA_UCBShift,C_X,C_Y,C_BEST_REF_SCORE,C_BEST_REF_COV,C_BEST_REF_MATCH,C_UCBShift,CA_X,CA_Y,CA_BEST_REF_SCORE,CA_BEST_REF_COV,CA_BEST_REF_MATCH,CA_UCBShift,CB_X,CB_Y,CB_BEST_REF_SCORE,CB_BEST_REF_COV,CB_BEST_REF_MATCH,CB_UCBShift,N_X,N_Y,N_BEST_REF_SCORE,N_BEST_REF_COV,N_BEST_REF_MATCH,N_UCBShift
1,MET,8.325255247918747,,0,0,0,8.325255247918747,4.3624092556554555,,0,0,0,4.3624092556554555,173.17569127419247,,0,0,0,173.17569127419247,55.060437346220446,,0,0,0,55.060437346220446,33.0955262997447,,0,0,0,33.0955262997447,119.34337304209123,,0,0,0,119.34337304209123
2,GLN,8.59443569064269,,0,0,0,8.59443569064269,5.0453777406426905,,0,0,0,5.0453777406426905,175.41179278845044,,0,0,0,175.41179278845044,55.02018579946165,,0,0,0,55.02018579946165,31.377134057242756,,0,0,0,31.377134057242756,121.56449557213897,,0,0,0,121.56449557213897
3,GLY,9.004960282045733,,0,0,0,9.004960282045733,4.113089285686536,,0,0,0,4.113089285686536,171.91869137344324,,0,0,0,171.91869137344324,44.39764697944278,,0,0,0,44.39764697944278,,,0,0,0,,111.5833378515762,,0,0,0,111.5833378515762
4,VAL,8.85521791007326,,0,0,0,8.85521791007326,4.90975053105783,,0,0,0,4.90975053105783,175.67337322065714,,0,0,0,175.67337322065714,60.4170380963703,,0,0,0,60.4170380963703,33.53346266808192,,0,0,0,33.53346266808192,123.3060058028083,,0,0,0,123.3060058028083
5,VAL,9.150995404895104,,0,0,0,9.150995404895104,4.538302344677545,,0,0,0,4.538302344677545,175.54850049435566,,0,0,0,175.54850049435566,62.36712472263292,,0,0,0,62.36712472263292,32.36570992842713,,0,0,0,32.36570992842713,128.81634295948496,,0,0,0,128.81634295948496
6,LYS,8.798340471484071,,0,0,0,8.798340471484071,4.637598061111111,,0,0,0,4.637598061111111,175.14818208477632,,0,0,0,175.14818208477632,55.17824267178932,,0,0,0,55.17824267178932,32.59833590222556,,0,0,0,32.59833590222556,129.19142843242315,,0,0,0,129.19142843242315
7,VAL,7.826154315501165,,0,0,0,7.826154315501165,4.583478286618936,,0,0,0,4.583478286618936,175.5961766895438,,0,0,0,175.5961766895438,59.65310910823621,,0,0,0,59.65310910823621,34.08036638293373,,0,0,0,34.08036638293373,118.32625930069375,,0,0,0,118.32625930069375
8,ASN,8.716698634903986,,0,0,0,8.716698634903986,4.736817395815296,,0,0,0,4.736817395815296,175.6303498045732,,0,0,0,175.6303498045732,54.50061471569542,,0,0,0,54.50061471569542,38.61810213630814,,0,0,0,38.61810213630814,121.14908953889999,,0,0,0,121.14908953889999
9,SER,8.155950916183818,,0,0,0,8.155950916183818,4.509409499711399,,0,0,0,4.509409499711399,173.90270748288378,,0,0,0,173.90270748288378,58.70255054838495,,0,0,0,58.70255054838495,63.69446728816184,,0,0,0,63.69446728816184,114.9923366016983,,0,0,0,114.9923366016983
10,ALA,7.825381822877123,,0,0,0,7.825381822877123,4.678968836813187,,0,0,0,4.678968836813187,175.62755957374847,,0,0,0,175.62755957374847,51.53952062482517,,0,0,0,51.53952062482517,21.209026936280388,,0,0,0,21.209026936280388,123.59980417701188,,0,0,0,123.59980417701188
11,LEU,8.842936864529914,,0,0,0,8.842936864529914,4.692970026651127,,0,0,0,4.692970026651127,175.393208560212,,0,0,0,175.393208560212,53.55410236096681,,0,0,0,53.55410236096681,44.08782473258963,,0,0,0,44.08782473258963,123.62656063129648,,0,0,0,123.62656063129648
12,ASN,8.685381814224664,,0,0,0,8.685381814224664,4.900649298229549,,0,0,0,4.900649298229549,174.41483360952378,,0,0,0,174.41483360952378,52.80954851106671,,0,0,0,52.80954851106671,39.14986691862027,,0,0,0,39.14986691862027,124.91913288655789,,0,0,0,124.91913288655789
13,MET,9.421559707276057,,0,0,0,9.421559707276057,5.007321584038184,,0,0,0,5.007321584038184,175.2261375819403,,0,0,0,175.2261375819403,54.96904085066045,,0,0,0,54.96904085066045,33.8193458954934,,0,0,0,33.8193458954934,125.78505907570207,,0,0,0,125.78505907570207
14,ARG,9.090284386707737,,0,0,0,9.090284386707737,5.353745062370963,,0,0,0,5.353745062370963,177.26980885329115,,0,0,0,177.26980885329115,54.63247098219558,,0,0,0,54.63247098219558,32.70946873769009,,0,0,0,32.70946873769009,128.19336250001666,,0,0,0,128.19336250001666
15,SER,9.008911740914641,,0,0,0,9.008911740914641,4.36121713967699,,0,0,0,4.36121713967699,173.56776078441558,,0,0,0,173.56776078441558,59.602391051554,,0,0,0,59.602391051554,63.66922026519036,,0,0,0,63.66922026519036,115.05203997112888,,0,0,0,115.05203997112888
16,GLY,7.080815010694861,,0,0,0,7.080815010694861,3.100706427117326,,0,0,0,3.100706427117326,171.45248276495172,,0,0,0,171.45248276495172,44.154537155888555,,0,0,0,44.154537155888555,,,0,0,0,,110.1452924963148,,0,0,0,110.1452924963148
17,PRO,,,0,0,0,,3.7290345805527805,,0,0,0,3.7290345805527805,173.77757990791986,,0,0,0,173.77757990791986,62.1226412540515,,0,0,0,62.1226412540515,29.468494411688315,,0,0,0,29.468494411688315,,,0,0,0,
18,GLY,7.5128015599678095,,0,0,0,7.5128015599678095,3.958003904972805,,0,0,0,3.958003904972805,174.2571794934288,,0,0,0,174.2571794934288,44.92358963460983,,0,0,0,44.92358963460983,,,0,0,0,,110.41151136993007,,0,0,0,110.41151136993007
19,SER,8.871436143506493,,0,0,0,8.871436143506493,4.324170381046731,,0,0,0,4.324170381046731,175.18959252796648,,0,0,0,175.18959252796648,60.69855239356754,,0,0,0,60.69855239356754,63.22742513817849,,0,0,0,63.22742513817849,115.98439163552558,,0,0,0,115.98439163552558
20,ASN,8.372266500444,,0,0,0,8.372266500444,4.654074660717061,,0,0,0,4.654074660717061,175.36957414210232,,0,0,0,175.36957414210232,53.599697623820624,,0,0,0,53.599697623820624,38.3232299956821,,0,0,0,38.3232299956821,118.43506983097458,,0,0,0,118.43506983097458
21,TYR,7.672234105877455,,0,0,0,7.672234105877455,4.428057222771673,,0,0,0,4.428057222771673,176.49109246225441,,0,0,0,176.49109246225441,58.0579985034743,,0,0,0,58.0579985034743,39.30536114522144,,0,0,0,39.30536114522144,120.04725374060384,,0,0,0,120.04725374060384
22,GLY,8.637408325718726,,0,0,0,8.637408325718726,4.048072705747031,,0,0,0,4.048072705747031,173.46513317357088,,0,0,0,173.46513317357088,45.13663994155289,,0,0,0,45.13663994155289,,,0,0,0,,110.31707700174825,,0,0,0,110.31707700174825
23,VAL,8.581577576640026,,0,0,0,8.581577576640026,4.280343370757021,,0,0,0,4.280343370757021,177.0383916489566,,0,0,0,177.0383916489566,63.1113820989788,,0,0,0,63.1113820989788,31.884665909346207,,0,0,0,31.884665909346207,122.01218523412699,,0,0,0,122.01218523412699
24,ILE,8.927095714729715,,0,0,0,8.927095714729715,4.5148155576728835,,0,0,0,4.5148155576728835,175.70622947990898,,0,0,0,175.70622947990898,61.06455177236097,,0,0,0,61.06455177236097,39.118683420102116,,0,0,0,39.118683420102116,123.43271330076591,,0,0,0,123.43271330076591
25,GLY,8.119842645243645,,0,0,0,8.119842645243645,4.164255539146964,,0,0,0,4.164255539146964,171.7619204550505,,0,0,0,171.7619204550505,45.779685417099564,,0,0,0,45.779685417099564,,,0,0,0,,108.35680412109556,,0,0,0,108.35680412109556
26,THR,8.40253516970252,,0,0,0,8.40253516970252,5.037618622843823,,0,0,0,5.037618622843823,173.14492730323565,,0,0,0,173.14492730323565,61.95293456437451,,0,0,0,61.95293456437451,71.59552683783438,,0,0,0,71.59552683783438,116.12607180303586,,0,0,0,116.12607180303586
27,LEU,8.884079921062272,,0,0,0,8.884079921062272,4.629429346825397,,0,0,0,4.629429346825397,176.30149753660783,,0,0,0,176.30149753660783,53.37128237004662,,0,0,0,53.37128237004662,43.72614611510711,,0,0,0,43.72614611510711,126.4324621524864,,0,0,0,126.4324621524864
28,ARG,8.862106998784549,,0,0,0,8.862106998784549,4.529758003230103,,0,0,0,4.529758003230103,175.91543262289377,,0,0,0,175.91543262289377,54.55713131567877,,0,0,0,54.55713131567877,32.212747146275944,,0,0,0,32.212747146275944,121.94758087066268,,0,0,0,121.94758087066268
29,ASN,8.575760706449106,,0,0,0,8.575760706449106,4.376025128751804,,0,0,0,4.376025128751804,175.87708695483406,,0,0,0,175.87708695483406,55.11018926675547,,0,0,0,55.11018926675547,38.73016847607948,,0,0,0,38.73016847607948,118.7423498488789,,0,0,0,118.7423498488789
30,ASN,9.060983165856367,,0,0,0,9.060983165856367,4.28149717946498,,0,0,0,4.28149717946498,174.90315304872348,,0,0,0,174.90315304872348,55.52030849130314,,0,0,0,55.52030849130314,37.425416592929295,,0,0,0,37.425416592929295,118.13868407742258,,0,0,0,118.13868407742258
31,ASP,7.935500168392718,,0,0,0,7.935500168392718,4.666398052991453,,0,0,0,4.666398052991453,175.87007847452549,,0,0,0,175.87007847452549,55.84154475612166,,0,0,0,55.84154475612166,41.56391311789322,,0,0,0,41.56391311789322,120.88720891405262,,0,0,0,120.88720891405262
32,LYS,8.506689181462981,,0,0,0,8.506689181462981,4.901459308402709,,0,0,0,4.901459308402709,175.90530278785104,,0,0,0,175.90530278785104,56.07862591688867,,0,0,0,56.07862591688867,33.447830732295486,,0,0,0,33.447830732295486,122.38796527506383,,0,0,0,122.38796527506383
33,VAL,9.013249336818737,,0,0,0,9.013249336818737,4.890284709140859,,0,0,0,4.890284709140859,174.20345688327228,,0,0,0,174.20345688327228,59.49019374154179,,0,0,0,59.49019374154179,35.08469507969808,,0,0,0,35.08469507969808,119.80235958431014,,0,0,0,119.80235958431014
34,GLU,8.628873996386947,,0,0,0,8.628873996386947,4.846734603374403,,0,0,0,4.846734603374403,175.886566953996,,0,0,0,175.886566953996,55.31709369305695,,0,0,0,55.31709369305695,30.77962359278499,,0,0,0,30.77962359278499,126.41576831957487,,0,0,0,126.41576831957487
35,ILE,9.274763049045399,,0,0,0,9.274763049045399,4.321448956768232,,0,0,0,4.321448956768232,175.77995471512378,,0,0,0,175.77995471512378,61.91324394365634,,0,0,0,61.91324394365634,37.793878629298476,,0,0,0,37.793878629298476,126.55839481102231,,0,0,0,126.55839481102231
36,ILE,8.945574787495838,,0,0,0,8.945574787495838,4.0627477099095355,,0,0,0,4.0627477099095355,176.52267970795316,,0,0,0,176.52267970795316,62.18495168385503,,0,0,0,62.18495168385503,38.32990587012432,,0,0,0,38.32990587012432,128.26986992499724,,0,0,0,128.26986992499724
37,LYS,7.729766127927627,,0,0,0,7.729766127927627,4.695236585481186,,0,0,0,4.695236585481186,174.2050823977356,,0,0,0,174.2050823977356,55.45035946847597,,0,0,0,55.45035946847597,35.2067167462926,,0,0,0,35.2067167462926,114.47006672141748,,0,0,0,114.47006672141748
38,GLU,8.685998845288045,,0,0,0,8.685998845288045,5.411220337146188,,0,0,0,5.411220337146188,176.3960916096015,,0,0,0,176.3960916096015,55.51894183830614,,0,0,0,55.51894183830614,31.39186322109557,,0,0,0,31.39186322109557,122.63958054961705,,0,0,0,122.63958054961705
39,VAL,9.064142204168053,,0,0,0,9.064142204168053,4.348465647569097,,0,0,0,4.348465647569097,175.75974906310358,,0,0,0,175.75974906310358,61.62032675472306,,0,0,0,61.62032675472306,34.315373813625264,,0,0,0,34.315373813625264,126.77227597085137,,0,0,0,126.77227597085137
40,ASP,9.389826643417694,,0,0,0,9.389826643417694,4.332416962204462,,0,0,0,4.332416962204462,175.67354030421245,,0,0,0,175.67354030421245,55.47895070231436,,0,0,0,55.47895070231436,40.44631838280608,,0,0,0,40.44631838280608,128.7868170686369,,0,0,0,128.7868170686369
41,GLY,8.426407263825064,,0,0,0,8.426407263825064,3.7949148712648464,,0,0,0,3.7949148712648464,173.3756560255134,,0,0,0,173.3756560255134,45.38449260964036,,0,0,0,45.38449260964036,,,0,0,0,,102.87336987739482,,0,0,0,102.87336987739482
42,TRP,8.19080757143412,,0,0,0,8.19080757143412,4.779173226828727,,0,0,0,4.779173226828727,174.9115298813464,,0,0,0,174.9115298813464,56.32129373471528,,0,0,0,56.32129373471528,31.805546588306143,,0,0,0,31.805546588306143,121.01517941077256,,0,0,0,121.01517941077256
43,TYR,9.321050746708845,,0,0,0,9.321050746708845,5.690255611310911,,0,0,0,5.690255611310911,175.52098289364525,,0,0,0,175.52098289364525,55.71160612939283,,0,0,0,55.71160612939283,39.411568704700855,,0,0,0,39.411568704700855,122.18013611062825,,0,0,0,122.18013611062825
44,GLU,9.310182145865245,,0,0,0,9.310182145865245,4.234973906787657,,0,0,0,4.234973906787657,175.54374902443112,,0,0,0,175.54374902443112,56.24075188106893,,0,0,0,56.24075188106893,30.69535220772561,,0,0,0,30.69535220772561,126.17058363145743,,0,0,0,126.17058363145743
45,ILE,9.25924592046287,,0,0,0,9.25924592046287,5.175098098390499,,0,0,0,5.175098098390499,174.1365962371906,,0,0,0,174.1365962371906,58.05086251656677,,0,0,0,58.05086251656677,42.09439436954157,,0,0,0,42.09439436954157,122.78593735932401,,0,0,0,122.78593735932401
46,ARG,8.995990165290266,,0,0,0,8.995990165290266,5.28516030046065,,0,0,0,5.28516030046065,175.24494514719171,,0,0,0,175.24494514719171,54.75800545564435,,0,0,0,54.75800545564435,32.337727503718504,,0,0,0,32.337727503718504,124.29375848810633,,0,0,0,124.29375848810633
47,PHE,9.314941486568987,,0,0,0,9.314941486568987,4.845612203524253,,0,0,0,4.845612203524253,174.84182996723277,,0,0,0,174.84182996723277,57.88056965972916,,0,0,0,57.88056965972916,42.66113949395604,,0,0,0,42.66113949395604,127.05570450483404,,0,0,0,127.05570450483404
48,ASN,8.73741561980797,,0,0,0,8.73741561980797,4.155587922471973,,0,0,0,4.155587922471973,174.83410528831723,,0,0,0,174.83410528831723,53.88385402229992,,0,0,0,53.88385402229992,37.45118017282162,,0,0,0,37.45118017282162,126.62046496379176,,0,0,0,126.62046496379176
49,GLY,8.486927013841713,,0,0,0,8.486927013841713,3.7909440626706625,,0,0,0,3.7909440626706625,173.9796894910312,,0,0,0,173.9796894910312,45.417015303441005,,0,0,0,45.417015303441005,,,0,0,0,,103.19906289057054,,0,0,0,103.19906289057054
50,LYS,7.740626778327227,,0,0,0,7.740626778327227,4.65638898990454,,0,0,0,4.65638898990454,175.16217208364966,,0,0,0,175.16217208364966,55.00095256617827,,0,0,0,55.00095256617827,34.304673290725944,,0,0,0,34.304673290725944,121.25938634368964,,0,0,0,121.25938634368964
51,VAL,8.515715971295371,,0,0,0,8.515715971295371,4.9822191239926745,,0,0,0,4.9822191239926745,175.74930841837607,,0,0,0,175.74930841837607,61.13830974028749,,0,0,0,61.13830974028749,33.405619816122766,,0,0,0,33.405619816122766,122.94820177761683,,0,0,0,122.94820177761683
52,GLY,8.926790778909979,,0,0,0,8.926790778909979,4.086147999619825,,0,0,0,4.086147999619825,171.59028772963703,,0,0,0,171.59028772963703,45.1016173980575,,0,0,0,45.1016173980575,,,0,0,0,,113.55292646296482,,0,0,0,113.55292646296482
53,TYR,9.201254273054722,,0,0,0,9.201254273054722,5.2857076523199025,,0,0,0,5.2857076523199025,174.73255112752247,,0,0,0,174.73255112752247,56.60046297051282,,0,0,0,56.60046297051282,41.01334620099345,,0,0,0,41.01334620099345,120.01481884178044,,0,0,0,120.01481884178044
54,ALA,9.426922468165168,,0,0,0,9.426922468165168,5.124064074370075,,0,0,0,5.124064074370075,175.50523592120103,,0,0,0,175.50523592120103,50.55361759485515,,0,0,0,50.55361759485515,24.294137327700078,,0,0,0,24.294137327700078,124.5246711575036,,0,0,0,124.5246711575036
55,SER,9.003624128138528,,0,0,0,9.003624128138528,3.491355801184927,,0,0,0,3.491355801184927,175.71299706888112,,0,0,0,175.71299706888112,58.243833136235985,,0,0,0,58.243833136235985,63.13822513973804,,0,0,0,63.13822513973804,116.8079465442391,,0,0,0,116.8079465442391
56,LYS,8.123722618803418,,0,0,0,8.123722618803418,3.773056088555889,,0,0,0,3.773056088555889,178.55312809084248,,0,0,0,178.55312809084248,58.60898372513043,,0,0,0,58.60898372513043,31.186263880702633,,0,0,0,31.186263880702633,126.7872623055056,,0,0,0,126.7872623055056
57,SER,7.69229195946276,,0,0,0,7.69229195946276,4.122309126701076,,0,0,0,4.122309126701076,175.16163285024976,,0,0,0,175.16163285024976,60.120330785797535,,0,0,0,60.120330785797535,62.64523109347319,,0,0,0,62.64523109347319,115.74551536848152,,0,0,0,115.74551536848152
58,TYR,7.4533363170607165,,0,0,0,7.4533363170607165,4.862775666400267,,0,0,0,4.862775666400267,173.91597323103008,,0,0,0,173.91597323103008,57.5934614505772,,0,0,0,57.5934614505772,39.11178193306138,,0,0,0,39.11178193306138,119.11413838954378,,0,0,0,119.11413838954378
59,ILE,7.459357247130647,,0,0,0,7.459357247130647,4.6555179594183596,,0,0,0,4.6555179594183596,175.43301130796982,,0,0,0,175.43301130796982,60.44024680906871,,0,0,0,60.44024680906871,39.10263903595293,,0,0,0,39.10263903595293,120.94353992160063,,0,0,0,120.94353992160063
60,THR,9.05564124907315,,0,0,0,9.05564124907315,4.624192243284493,,0,0,0,4.624192243284493,173.9810367203907,,0,0,0,173.9810367203907,61.78291518922189,,0,0,0,61.78291518922189,69.68751024429459,,0,0,0,69.68751024429459,123.52100951199911,,0,0,0,123.52100951199911
61,ILE,8.878567273559774,,0,0,0,8.878567273559774,4.195088102933179,,0,0,0,4.195088102933179,175.748666306549,,0,0,0,175.748666306549,62.197554253629704,,0,0,0,62.197554253629704,38.667655446808745,,0,0,0,38.667655446808745,127.50457900872462,,0,0,0,127.50457900872462
62,VAL,8.830505584027083,,0,0,0,8.830505584027083,4.117131222299922,,0,0,0,4.117131222299922,175.52412241728828,,0,0,0,175.52412241728828,61.86183642249417,,0,0,0,61.86183642249417,31.87425594487179,,0,0,0,31.87425594487179,128.38220225777002,,0,0,0,128.38220225777002
63,ASN,8.224627523781773,,0,0,0,8.224627523781773,4.800747265623266,,0,0,0,4.800747265623266,175.50672963159616,,0,0,0,175.50672963159616,52.09141003792319,,0,0,0,52.09141003792319,39.72716125638251,,0,0,0,39.72716125638251,125.01118625714285,,0,0,0,125.01118625714285
64,GLU,8.772123843029192,,0,0,0,8.772123843029192,4.168702832192807,,0,0,0,4.168702832192807,177.0532657967255,,0,0,0,177.0532657967255,57.71054658215118,,0,0,0,57.71054658215118,29.46003694068154,,0,0,0,29.46003694068154,124.41270364430015,,0,0,0,124.41270364430015
65,GLY,8.05223774022644,,0,0,0,8.05223774022644,3.986235566741592,,0,0,0,3.986235566741592,174.59910759895106,,0,0,0,174.59910759895106,45.39138860796426,,0,0,0,45.39138860796426,,,0,0,0,,108.5901283401543,,0,0,0,108.5901283401543
66,SER,7.999895776950828,,0,0,0,7.999895776950828,4.620579156049506,,0,0,0,4.620579156049506,174.44567897648463,,0,0,0,174.44567897648463,58.60937322228327,,0,0,0,58.60937322228327,63.65799637602952,,0,0,0,63.65799637602952,115.87723931065601,,0,0,0,115.87723931065601
67,LEU,8.138035703657454,,0,0,0,8.138035703657454,4.406002123731824,,0,0,0,4.406002123731824,176.97017272711733,,0,0,0,176.97017272711733,54.9169506948385,,0,0,0,54.9169506948385,42.28171815486181,,0,0,0,42.28171815486181,123.78716370090464,,0,0,0,123.78716370090464
68,GLU,8.395509922999222,,0,0,0,8.395509922999222,4.208671467884892,,0,0,0,4.208671467884892,176.28964011905316,,0,0,0,176.28964011905316,56.44123579150294,,0,0,0,56.44123579150294,29.743266102575202,,0,0,0,29.743266102575202,123.10188788209568,,0,0,0,123.10188788209568
69,HIS,8.466857521273171,,0,0,0,8.466857521273171,4.379413872649573,,0,0,0,4.379413872649573,175.13953296396937,,0,0,0,175.13953296396937,56.13890629347319,,0,0,0,56.13890629347319,28.881576912753914,,0,0,0,28.881576912753914,121.81950251542347,,0,0,0,121.81950251542347
70,HIS,8.217945317371518,,0,0,0,8.217945317371518,4.447915121722722,,0,0,0,4.447915121722722,174.65509757252747,,0,0,0,174.65509757252747,55.59930996960817,,0,0,0,55.59930996960817,28.524761894605394,,0,0,0,28.524761894605394,120.96742937428128,,0,0,0,120.96742937428128
71,HIS,8.137360545948496,,0,0,0,8.137360545948496,4.344953834632035,,0,0,0,4.344953834632035,174.5737734834055,,0,0,0,174.5737734834055,56.86992593650793,,0,0,0,56.86992593650793,29.807534385608836,,0,0,0,29.807534385608836,120.3136582921301,,0,0,0,120.3136582921301
72,HIS,8.597723973548673,,0,0,0,8.597723973548673,4.509912075496726,,0,0,0,4.509912075496726,174.2517614812909,,0,0,0,174.2517614812909,55.612344549222996,,0,0,0,55.612344549222996,29.966407397352647,,0,0,0,29.966407397352647,120.90609048015318,,0,0,0,120.90609048015318
73,HIS,8.433131721744921,,0,0,0,8.433131721744921,4.338298925446775,,0,0,0,4.338298925446775,174.29756788493728,,0,0,0,174.29756788493728,56.096095458535906,,0,0,0,56.096095458535906,30.383155786119435,,0,0,0,30.383155786119435,120.82796122573538,,0,0,0,120.82796122573538
74,HIS,8.232257318403818,,0,0,0,8.232257318403818,4.506544267260517,,0,0,0,4.506544267260517,175.76556957060717,,0,0,0,175.76556957060717,56.12379857328227,,0,0,0,56.12379857328227,30.612960316539017,,0,0,0,30.612960316539017,122.2300658892663,,0,0,0,122.2300658892663
