RESNUM,RESNAME,H_X,H_Y,H_BEST_REF_SCORE,H_BEST_REF_COV,H_BEST_REF_MATCH,H_UCBShift,HA_X,HA_Y,HA_BEST_REF_SCORE,HA_BEST_REF_COV,HA_BEST_REF_MATCH,HA_UCBShift,C_X,C_Y,C_BEST_REF_SCORE,C_BEST_REF_COV,C_BEST_REF_MATCH,C_UCBShift,CA_X,CA_Y,CA_BEST_REF_SCORE,CA_BEST_REF_COV,CA_BEST_REF_MATCH,CA_UCBShift,CB_X,CB_Y,CB_BEST_REF_SCORE,CB_BEST_REF_COV,CB_BEST_REF_MATCH,CB_UCBShift,N_X,N_Y,N_BEST_REF_SCORE,N_BEST_REF_COV,N_BEST_REF_MATCH,N_UCBShift
1,MET,8.302037033860584,,0,0,0,8.302037033860584,4.354991573970474,,0,0,0,4.354991573970474,174.54269906186036,,0,0,0,174.54269906186036,55.32471301848707,,0,0,0,55.32471301848707,33.12041907662338,,0,0,0,33.12041907662338,121.299838947114,,0,0,0,121.299838947114
2,ASN,8.320923392851594,,0,0,0,8.320923392851594,4.7066212497114,,0,0,0,4.7066212497114,174.5545433813242,,0,0,0,174.5545433813242,53.128483232301036,,0,0,0,53.128483232301036,38.99787160538905,,0,0,0,38.99787160538905,120.81287955466756,,0,0,0,120.81287955466756
3,ASP,8.377898824453323,,0,0,0,8.377898824453323,4.608276998132423,,0,0,0,4.608276998132423,175.13357169324564,,0,0,0,175.13357169324564,54.659732999933404,,0,0,0,54.659732999933404,41.02326118078033,,0,0,0,41.02326118078033,122.12266011918082,,0,0,0,122.12266011918082
4,ASP,8.381140978798978,,0,0,0,8.381140978798978,4.5632737742424245,,0,0,0,4.5632737742424245,176.16247694654237,,0,0,0,176.16247694654237,54.6199484485459,,0,0,0,54.6199484485459,40.9910528014208,,0,0,0,40.9910528014208,122.47464761612832,,0,0,0,122.47464761612832
5,VAL,8.052382916916416,,0,0,0,8.052382916916416,4.172303422999223,,0,0,0,4.172303422999223,175.69293491519036,,0,0,0,175.69293491519036,61.87276752147852,,0,0,0,61.87276752147852,32.80105237359307,,0,0,0,32.80105237359307,120.66308841400821,,0,0,0,120.66308841400821
6,ASP,8.344792564774115,,0,0,0,8.344792564774115,4.611868635031635,,0,0,0,4.611868635031635,175.89422644371186,,0,0,0,175.89422644371186,54.20823135880231,,0,0,0,54.20823135880231,39.88754924695305,,0,0,0,39.88754924695305,124.62835170700411,,0,0,0,124.62835170700411
7,ILE,7.641231476651127,,0,0,0,7.641231476651127,4.023135138350538,,0,0,0,4.023135138350538,175.74420154270175,,0,0,0,175.74420154270175,61.040106685064934,,0,0,0,61.040106685064934,37.63128477077922,,0,0,0,37.63128477077922,121.99439997814409,,0,0,0,121.99439997814409
8,GLN,7.920867634598736,,0,0,0,7.920867634598736,4.251811253846154,,0,0,0,4.251811253846154,176.30945334378956,,0,0,0,176.30945334378956,55.49368434256854,,0,0,0,55.49368434256854,28.567950723515374,,0,0,0,28.567950723515374,125.86194148524253,,0,0,0,125.86194148524253
9,GLN,8.13777192069042,,0,0,0,8.13777192069042,3.9799963015429016,,0,0,0,3.9799963015429016,175.26950427160617,,0,0,0,175.26950427160617,55.86039306949717,,0,0,0,55.86039306949717,28.42868107910978,,0,0,0,28.42868107910978,123.25791891892551,,0,0,0,123.25791891892551
10,SER,8.219067762398712,,0,0,0,8.219067762398712,4.343570437229437,,0,0,0,4.343570437229437,173.7761507347153,,0,0,0,173.7761507347153,57.58662728125763,,0,0,0,57.58662728125763,63.562637056560106,,0,0,0,63.562637056560106,117.28479627346542,,0,0,0,117.28479627346542
11,TYR,8.353609792579642,,0,0,0,8.353609792579642,4.31271416478244,,0,0,0,4.31271416478244,174.57657009725276,,0,0,0,174.57657009725276,56.747084857126204,,0,0,0,56.747084857126204,38.29887400767566,,0,0,0,38.29887400767566,123.96608505337996,,0,0,0,123.96608505337996
12,PRO,,,0,0,0,,4.711590721495171,,0,0,0,4.711590721495171,176.6024072881896,,0,0,0,176.6024072881896,62.922728506393604,,0,0,0,62.922728506393604,32.04754683963814,,0,0,0,32.04754683963814,,,0,0,0,
13,PHE,8.634622066622267,,0,0,0,8.634622066622267,5.263142545021644,,0,0,0,5.263142545021644,174.8151400843268,,0,0,0,174.8151400843268,56.35456469616495,,0,0,0,56.35456469616495,41.83612793444333,,0,0,0,41.83612793444333,122.46098797130092,,0,0,0,122.46098797130092
14,SER,9.09481350958486,,0,0,0,9.09481350958486,4.662356986557886,,0,0,0,4.662356986557886,173.18453822888776,,0,0,0,173.18453822888776,56.93751231678321,,0,0,0,56.93751231678321,65.38068702687868,,0,0,0,65.38068702687868,117.57555596662782,,0,0,0,117.57555596662782
15,ILE,8.603364449245198,,0,0,0,8.603364449245198,4.585271293678544,,0,0,0,4.585271293678544,175.22064597152848,,0,0,0,175.22064597152848,59.311396247136194,,0,0,0,59.311396247136194,38.450906557770004,,0,0,0,38.450906557770004,123.14983035246976,,0,0,0,123.14983035246976
16,GLU,8.877836220523921,,0,0,0,8.877836220523921,4.5708497308691305,,0,0,0,4.5708497308691305,175.19966151787656,,0,0,0,175.19966151787656,55.18340792056832,,0,0,0,55.18340792056832,31.60959613929404,,0,0,0,31.60959613929404,128.75561794214673,,0,0,0,128.75561794214673
17,THR,8.496040937357089,,0,0,0,8.496040937357089,5.367097833843934,,0,0,0,5.367097833843934,174.52198355426793,,0,0,0,174.52198355426793,59.77209956148296,,0,0,0,59.77209956148296,71.08300173755688,,0,0,0,71.08300173755688,118.52377423301142,,0,0,0,118.52377423301142
18,MET,8.611342082217782,,0,0,0,8.611342082217782,4.724063750166501,,0,0,0,4.724063750166501,173.92537990599953,,0,0,0,173.92537990599953,54.121557226856474,,0,0,0,54.121557226856474,32.44715056754357,,0,0,0,32.44715056754357,124.19268815295816,,0,0,0,124.19268815295816
19,PRO,,,0,0,0,,4.423170755203131,,0,0,0,4.423170755203131,176.95443621090578,,0,0,0,176.95443621090578,63.416039948362744,,0,0,0,63.416039948362744,31.630524826573428,,0,0,0,31.630524826573428,,,0,0,0,
20,VAL,8.34102239055944,,0,0,0,8.34102239055944,4.380349253335554,,0,0,0,4.380349253335554,174.38350389464424,,0,0,0,174.38350389464424,59.1452840530636,,0,0,0,59.1452840530636,32.526452283860586,,0,0,0,32.526452283860586,120.95145193694084,,0,0,0,120.95145193694084
21,PRO,,,0,0,0,,4.496277613186813,,0,0,0,4.496277613186813,177.1512245352703,,0,0,0,177.1512245352703,62.8719836007659,,0,0,0,62.8719836007659,32.46282898280053,,0,0,0,32.46282898280053,,,0,0,0,
22,LYS,8.526838624486624,,0,0,0,8.526838624486624,4.276297679032079,,0,0,0,4.276297679032079,176.4104455586136,,0,0,0,176.4104455586136,58.0685501512987,,0,0,0,58.0685501512987,33.06551749458875,,0,0,0,33.06551749458875,120.64217096983018,,0,0,0,120.64217096983018
23,LYS,7.863582684287934,,0,0,0,7.863582684287934,5.16544675870796,,0,0,0,5.16544675870796,175.95604146978576,,0,0,0,175.95604146978576,55.22766490427906,,0,0,0,55.22766490427906,34.00014447057942,,0,0,0,34.00014447057942,118.30337043356089,,0,0,0,118.30337043356089
24,LEU,8.248287247635698,,0,0,0,8.248287247635698,4.646868010495061,,0,0,0,4.646868010495061,175.8434308585137,,0,0,0,175.8434308585137,53.553928331340884,,0,0,0,53.553928331340884,45.37408652102897,,0,0,0,45.37408652102897,125.50654121862581,,0,0,0,125.50654121862581
25,LYS,8.417077286979685,,0,0,0,8.417077286979685,4.436080687185037,,0,0,0,4.436080687185037,176.76857341096127,,0,0,0,176.76857341096127,55.41646552826063,,0,0,0,55.41646552826063,33.578906236308136,,0,0,0,33.578906236308136,121.11171122897103,,0,0,0,121.11171122897103
26,VAL,8.36089565074925,,0,0,0,8.36089565074925,3.6512186493312244,,0,0,0,3.6512186493312244,177.4227352474359,,0,0,0,177.4227352474359,64.96505124882896,,0,0,0,64.96505124882896,31.166645659562658,,0,0,0,31.166645659562658,119.82581097940393,,0,0,0,119.82581097940393
27,GLY,9.089226974325674,,0,0,0,9.089226974325674,3.9066798641858136,,0,0,0,3.9066798641858136,174.4226889753247,,0,0,0,174.4226889753247,45.082568714879564,,0,0,0,45.082568714879564,,,0,0,0,,115.43994666063381,,0,0,0,115.43994666063381
28,GLU,7.988711987612388,,0,0,0,7.988711987612388,4.4063645539599285,,0,0,0,4.4063645539599285,175.56415042668996,,0,0,0,175.56415042668996,56.573238204362305,,0,0,0,56.573238204362305,31.104299108169606,,0,0,0,31.104299108169606,121.45650857403707,,0,0,0,121.45650857403707
29,THR,8.446073434432234,,0,0,0,8.446073434432234,5.087895666694417,,0,0,0,5.087895666694417,174.19340115456765,,0,0,0,174.19340115456765,61.550768877439225,,0,0,0,61.550768877439225,69.87431380050505,,0,0,0,69.87431380050505,118.64552236092241,,0,0,0,118.64552236092241
30,ALA,9.014563776462426,,0,0,0,9.014563776462426,4.642636458480409,,0,0,0,4.642636458480409,174.94986611636142,,0,0,0,174.94986611636142,50.82142241822622,,0,0,0,50.82142241822622,21.026572743378846,,0,0,0,21.026572743378846,130.55316487213898,,0,0,0,130.55316487213898
31,GLU,8.63114060142635,,0,0,0,8.63114060142635,4.650356735625485,,0,0,0,4.650356735625485,175.48571924458318,,0,0,0,175.48571924458318,55.6416946992563,,0,0,0,55.6416946992563,30.875995043523144,,0,0,0,30.875995043523144,123.32621524472195,,0,0,0,123.32621524472195
32,ILE,8.87492790835276,,0,0,0,8.87492790835276,4.271808962240538,,0,0,0,4.271808962240538,174.16299806017315,,0,0,0,174.16299806017315,60.238946433899436,,0,0,0,60.238946433899436,39.43210049412809,,0,0,0,39.43210049412809,126.64569596934179,,0,0,0,126.64569596934179
33,ARG,8.885738262415362,,0,0,0,8.885738262415362,4.513086627927628,,0,0,0,4.513086627927628,174.75642463011434,,0,0,0,174.75642463011434,55.90648064890665,,0,0,0,55.90648064890665,30.915324607431458,,0,0,0,30.915324607431458,128.58627590553334,,0,0,0,128.58627590553334
34,CYS,8.948042233300033,,0,0,0,8.948042233300033,5.107273262992563,,0,0,0,5.107273262992563,172.65360127919857,,0,0,0,172.65360127919857,56.61957608508713,,0,0,0,56.61957608508713,28.49425714088134,,0,0,0,28.49425714088134,124.82506148407703,,0,0,0,124.82506148407703
35,GLN,8.72840477933733,,0,0,0,8.72840477933733,4.9242149408480405,,0,0,0,4.9242149408480405,174.19331132996447,,0,0,0,174.19331132996447,54.02936158149073,,0,0,0,54.02936158149073,32.29579721252637,,0,0,0,32.29579721252637,122.74264933829504,,0,0,0,122.74264933829504
36,LEU,8.88018597983683,,0,0,0,8.88018597983683,4.805571142562993,,0,0,0,4.805571142562993,174.84434688122988,,0,0,0,174.84434688122988,54.55989325698746,,0,0,0,54.55989325698746,42.87777673442113,,0,0,0,42.87777673442113,129.0033386665168,,0,0,0,129.0033386665168
37,HIS,9.106375099622598,,0,0,0,9.106375099622598,4.820240421611722,,0,0,0,4.820240421611722,174.38307592963147,,0,0,0,174.38307592963147,54.90364691088911,,0,0,0,54.90364691088911,30.999497077755578,,0,0,0,30.999497077755578,126.3919804078921,,0,0,0,126.3919804078921
38,ARG,8.967299217643468,,0,0,0,8.967299217643468,4.8637009498779,,0,0,0,4.8637009498779,175.9892084383561,,0,0,0,175.9892084383561,55.0883685009768,,0,0,0,55.0883685009768,32.11989223423244,,0,0,0,32.11989223423244,124.4090212540959,,0,0,0,124.4090212540959
39,ASP,8.77908789930625,,0,0,0,8.77908789930625,4.744845377805528,,0,0,0,4.744845377805528,175.3304194403208,,0,0,0,175.3304194403208,54.11702821148296,,0,0,0,54.11702821148296,40.31080472484183,,0,0,0,40.31080472484183,124.71252167911533,,0,0,0,124.71252167911533
40,GLY,7.975433092229992,,0,0,0,7.975433092229992,3.861625272818848,,0,0,0,3.861625272818848,173.52309846961927,,0,0,0,173.52309846961927,45.06247880811966,,0,0,0,45.06247880811966,,,0,0,0,,109.37645136460762,,0,0,0,109.37645136460762
41,ARG,8.16544400937951,,0,0,0,8.16544400937951,4.4356938214174715,,0,0,0,4.4356938214174715,175.13271232675658,,0,0,0,175.13271232675658,55.48439747027417,,0,0,0,55.48439747027417,30.809474784970583,,0,0,0,30.809474784970583,120.43242815423466,,0,0,0,120.43242815423466
42,PHE,8.206553650438451,,0,0,0,8.206553650438451,4.48855703075813,,0,0,0,4.48855703075813,175.86713496172717,,0,0,0,175.86713496172717,56.5449747473138,,0,0,0,56.5449747473138,39.43164656006216,,0,0,0,39.43164656006216,122.6023575041292,,0,0,0,122.6023575041292
43,GLU,8.838862565678765,,0,0,0,8.838862565678765,4.133671615118215,,0,0,0,4.133671615118215,177.4256986807526,,0,0,0,177.4256986807526,58.45329543101898,,0,0,0,58.45329543101898,29.522394456671105,,0,0,0,29.522394456671105,122.63425268015318,,0,0,0,122.63425268015318
44,GLU,8.6629721503219,,0,0,0,8.6629721503219,4.238351944425019,,0,0,0,4.238351944425019,176.51718964194694,,0,0,0,176.51718964194694,56.380783157042956,,0,0,0,56.380783157042956,29.078198633155733,,0,0,0,29.078198633155733,116.90653911880341,,0,0,0,116.90653911880341
45,THR,7.4227951387112885,,0,0,0,7.4227951387112885,3.9099664353424357,,0,0,0,3.9099664353424357,173.61656823129093,,0,0,0,173.61656823129093,63.73932847367632,,0,0,0,63.73932847367632,68.95935406699411,,0,0,0,68.95935406699411,117.26798030149294,,0,0,0,117.26798030149294
46,LYS,8.09643591114996,,0,0,0,8.09643591114996,4.16995218000888,,0,0,0,4.16995218000888,175.7760821609557,,0,0,0,175.7760821609557,55.532856170368525,,0,0,0,55.532856170368525,33.197156133039186,,0,0,0,33.197156133039186,126.82764224962816,,0,0,0,126.82764224962816
47,TYR,8.379685948523697,,0,0,0,8.379685948523697,5.138824004517705,,0,0,0,5.138824004517705,174.63765531969696,,0,0,0,174.63765531969696,57.118850710828056,,0,0,0,57.118850710828056,41.044575834981686,,0,0,0,41.044575834981686,122.30210636496837,,0,0,0,122.30210636496837
48,PHE,9.516372417316017,,0,0,0,9.516372417316017,5.395791140137639,,0,0,0,5.395791140137639,174.60579009321236,,0,0,0,174.60579009321236,56.27722826682207,,0,0,0,56.27722826682207,42.59745928300033,,0,0,0,42.59745928300033,121.10419900311355,,0,0,0,121.10419900311355
49,ILE,9.296042527167277,,0,0,0,9.296042527167277,5.1632830069652575,,0,0,0,5.1632830069652575,173.44307369936175,,0,0,0,173.44307369936175,58.61282306288712,,0,0,0,58.61282306288712,41.032255302109,,0,0,0,41.032255302109,122.67142385144855,,0,0,0,122.67142385144855
50,ARG,9.064969284304585,,0,0,0,9.064969284304585,5.672630693634145,,0,0,0,5.672630693634145,174.96444763394385,,0,0,0,174.96444763394385,53.92522618885004,,0,0,0,53.92522618885004,34.343889022011325,,0,0,0,34.343889022011325,126.5831988460928,,0,0,0,126.5831988460928
51,TYR,8.963939015567766,,0,0,0,8.963939015567766,6.0628762611111116,,0,0,0,6.0628762611111116,173.31083650898546,,0,0,0,173.31083650898546,55.242573533682986,,0,0,0,55.242573533682986,42.18855033408258,,0,0,0,42.18855033408258,121.1299996041625,,0,0,0,121.1299996041625
52,PHE,9.556832355239205,,0,0,0,9.556832355239205,4.897980510989011,,0,0,0,4.897980510989011,173.0135698965479,,0,0,0,173.0135698965479,56.668760248529246,,0,0,0,56.668760248529246,42.77481266087246,,0,0,0,42.77481266087246,121.7288514443834,,0,0,0,121.7288514443834
53,GLN,7.89504666101121,,0,0,0,7.89504666101121,5.139772976506826,,0,0,0,5.139772976506826,173.3825150369575,,0,0,0,173.3825150369575,52.11472468995449,,0,0,0,52.11472468995449,30.494290421312023,,0,0,0,30.494290421312023,126.39734759507158,,0,0,0,126.39734759507158
54,PRO,,,0,0,0,,4.376133434410034,,0,0,0,4.376133434410034,176.51394224569322,,0,0,0,176.51394224569322,63.98610272108447,,0,0,0,63.98610272108447,32.27612605628261,,0,0,0,32.27612605628261,,,0,0,0,
55,ASP,7.82519284059274,,0,0,0,7.82519284059274,4.851159770912421,,0,0,0,4.851159770912421,176.27040543561995,,0,0,0,176.27040543561995,53.89160906373627,,0,0,0,53.89160906373627,44.36346582679543,,0,0,0,44.36346582679543,116.72398199616495,,0,0,0,116.72398199616495
56,GLY,8.541213995282495,,0,0,0,8.541213995282495,4.065185344721945,,0,0,0,4.065185344721945,172.5550838447608,,0,0,0,172.5550838447608,45.00642926518481,,0,0,0,45.00642926518481,,,0,0,0,,110.721854008769,,0,0,0,110.721854008769
57,ALA,8.135066403285604,,0,0,0,8.135066403285604,4.710634166633367,,0,0,0,4.710634166633367,176.5726690992896,,0,0,0,176.5726690992896,51.59606451712177,,0,0,0,51.59606451712177,21.06709432796648,,0,0,0,21.06709432796648,122.28230470385725,,0,0,0,122.28230470385725
58,GLY,8.306334003668553,,0,0,0,8.306334003668553,4.091135444180819,,0,0,0,4.091135444180819,171.69367920717062,,0,0,0,171.69367920717062,45.81571507630148,,0,0,0,45.81571507630148,,,0,0,0,,109.06661546427462,,0,0,0,109.06661546427462
59,THR,8.504931833649684,,0,0,0,8.504931833649684,4.77944013941059,,0,0,0,4.77944013941059,172.428564092119,,0,0,0,172.428564092119,61.149798795920745,,0,0,0,61.149798795920745,71.4502413528638,,0,0,0,71.4502413528638,113.84199888325563,,0,0,0,113.84199888325563
60,LEU,8.816543208319459,,0,0,0,8.816543208319459,4.8448155968864475,,0,0,0,4.8448155968864475,174.65782714227439,,0,0,0,174.65782714227439,53.601777578615824,,0,0,0,53.601777578615824,44.058836831990234,,0,0,0,44.058836831990234,128.18418534000443,,0,0,0,128.18418534000443
61,LYS,9.080065899045398,,0,0,0,9.080065899045398,5.165427846719947,,0,0,0,5.165427846719947,175.64836603238427,,0,0,0,175.64836603238427,54.51533697389278,,0,0,0,54.51533697389278,35.9080764955378,,0,0,0,35.9080764955378,126.77468274741925,,0,0,0,126.77468274741925
62,MET,9.101368508141858,,0,0,0,9.101368508141858,5.030316469252969,,0,0,0,5.030316469252969,178.8527335582251,,0,0,0,178.8527335582251,55.13781225884671,,0,0,0,55.13781225884671,33.00056885165945,,0,0,0,33.00056885165945,123.6877777501998,,0,0,0,123.6877777501998
63,SER,9.040947950799202,,0,0,0,9.040947950799202,4.366087958463758,,0,0,0,4.366087958463758,174.658032858325,,0,0,0,174.658032858325,60.88695313801753,,0,0,0,60.88695313801753,62.904866906549,,0,0,0,62.904866906549,117.50212338446553,,0,0,0,117.50212338446553
64,ASP,8.134820232339882,,0,0,0,8.134820232339882,4.695940320210346,,0,0,0,4.695940320210346,176.95518290947388,,0,0,0,176.95518290947388,53.77407824905095,,0,0,0,53.77407824905095,40.189830922610724,,0,0,0,40.189830922610724,120.06076501847042,,0,0,0,120.06076501847042
65,GLY,8.102034767632368,,0,0,0,8.102034767632368,4.0092851336052835,,0,0,0,4.0092851336052835,174.32273684596515,,0,0,0,174.32273684596515,45.270596215606616,,0,0,0,45.270596215606616,,,0,0,0,,108.82961041948607,,0,0,0,108.82961041948607
66,THR,8.18232206961927,,0,0,0,8.18232206961927,4.208401878360528,,0,0,0,4.208401878360528,173.64179216237096,,0,0,0,173.64179216237096,63.76514575530025,,0,0,0,63.76514575530025,69.79188428498723,,0,0,0,69.79188428498723,117.35545254985014,,0,0,0,117.35545254985014
67,VAL,8.645140068914419,,0,0,0,8.645140068914419,4.216188395054945,,0,0,0,4.216188395054945,175.62276578240093,,0,0,0,175.62276578240093,62.37990165537241,,0,0,0,62.37990165537241,32.20828028066933,,0,0,0,32.20828028066933,127.41119195191476,,0,0,0,127.41119195191476
68,LEU,8.937509095365746,,0,0,0,8.937509095365746,3.9643217580058834,,0,0,0,3.9643217580058834,175.73851420173713,,0,0,0,175.73851420173713,54.596290325912975,,0,0,0,54.596290325912975,42.53188690079365,,0,0,0,42.53188690079365,129.20657613146298,,0,0,0,129.20657613146298
69,LEU,8.644326736985239,,0,0,0,8.644326736985239,4.879360399039849,,0,0,0,4.879360399039849,175.64007769997778,,0,0,0,175.64007769997778,52.138600915667666,,0,0,0,52.138600915667666,41.64215725936286,,0,0,0,41.64215725936286,123.53655447203907,,0,0,0,123.53655447203907
70,PRO,,,0,0,0,,3.841074052095128,,0,0,0,3.841074052095128,177.48077915172607,,0,0,0,177.48077915172607,63.05662751969142,,0,0,0,63.05662751969142,31.790785063042513,,0,0,0,31.790785063042513,,,0,0,0,
71,ASN,9.01436919905095,,0,0,0,9.01436919905095,4.241775413830614,,0,0,0,4.241775413830614,173.92672819941723,,0,0,0,173.92672819941723,55.08997157313797,,0,0,0,55.08997157313797,37.697407981851484,,0,0,0,37.697407981851484,116.47769051265402,,0,0,0,116.47769051265402
72,ASP,8.031997432794983,,0,0,0,8.031997432794983,4.793067577977578,,0,0,0,4.793067577977578,174.74463706809303,,0,0,0,174.74463706809303,53.64957642219447,,0,0,0,53.64957642219447,42.701980501542906,,0,0,0,42.701980501542906,120.62613363885559,,0,0,0,120.62613363885559
73,LEU,8.251930557675658,,0,0,0,8.251930557675658,5.130728228144079,,0,0,0,5.130728228144079,175.98678039015428,,0,0,0,175.98678039015428,53.68742203115218,,0,0,0,53.68742203115218,43.6816750016761,,0,0,0,43.6816750016761,123.59235538480964,,0,0,0,123.59235538480964
74,TYR,9.323823028488178,,0,0,0,9.323823028488178,5.060278583855033,,0,0,0,5.060278583855033,173.88284578426018,,0,0,0,173.88284578426018,55.08401600258075,,0,0,0,55.08401600258075,40.48592862617937,,0,0,0,40.48592862617937,121.82375293318903,,0,0,0,121.82375293318903
75,PRO,,,0,0,0,,4.518205521983572,,0,0,0,4.518205521983572,176.58444172953713,,0,0,0,176.58444172953713,62.256578622677324,,0,0,0,62.256578622677324,31.915725162903765,,0,0,0,31.915725162903765,,,0,0,0,
76,LEU,8.583470726390276,,0,0,0,8.583470726390276,4.416118933030858,,0,0,0,4.416118933030858,175.74779739773004,,0,0,0,175.74779739773004,52.74600526413587,,0,0,0,52.74600526413587,41.33705303232323,,0,0,0,41.33705303232323,123.53742063776778,,0,0,0,123.53742063776778
77,PRO,,,0,0,0,,4.462799420623821,,0,0,0,4.462799420623821,175.64495310254745,,0,0,0,175.64495310254745,63.580325717249416,,0,0,0,63.580325717249416,31.896270060994564,,0,0,0,31.896270060994564,,,0,0,0,
78,GLY,7.757825203163504,,0,0,0,7.757825203163504,4.075090405316906,,0,0,0,4.075090405316906,173.10164057026307,,0,0,0,173.10164057026307,45.055190556981906,,0,0,0,45.055190556981906,,,0,0,0,,108.08079027374292,,0,0,0,108.08079027374292
79,GLU,8.66532488058608,,0,0,0,8.66532488058608,4.240003694264069,,0,0,0,4.240003694264069,176.17762409251858,,0,0,0,176.17762409251858,58.881743414296814,,0,0,0,58.881743414296814,30.506875316294817,,0,0,0,30.506875316294817,118.94924456591187,,0,0,0,118.94924456591187
80,THR,7.838335495759796,,0,0,0,7.838335495759796,5.09308485044955,,0,0,0,5.09308485044955,174.06587150158728,,0,0,0,174.06587150158728,62.03928583928849,,0,0,0,62.03928583928849,70.02624359245755,,0,0,0,70.02624359245755,115.17569076074481,,0,0,0,115.17569076074481
81,PHE,8.39794306012876,,0,0,0,8.39794306012876,5.021556125774226,,0,0,0,5.021556125774226,173.07274611647796,,0,0,0,173.07274611647796,55.779256374764124,,0,0,0,55.779256374764124,40.98448442788323,,0,0,0,40.98448442788323,123.51363941293707,,0,0,0,123.51363941293707
82,ARG,8.601091688622489,,0,0,0,8.601091688622489,5.218273287201687,,0,0,0,5.218273287201687,174.4592022102675,,0,0,0,174.4592022102675,54.87294533483183,,0,0,0,54.87294533483183,33.106782093401044,,0,0,0,33.106782093401044,120.27038268388833,,0,0,0,120.27038268388833
83,LEU,8.821433933111333,,0,0,0,8.821433933111333,5.227227184493285,,0,0,0,5.227227184493285,175.05878602220002,,0,0,0,175.05878602220002,52.8802093515318,,0,0,0,52.8802093515318,44.65454021408591,,0,0,0,44.65454021408591,122.47377335104895,,0,0,0,122.47377335104895
84,TYR,9.16154288980464,,0,0,0,9.16154288980464,5.324925823126873,,0,0,0,5.324925823126873,175.3808467614441,,0,0,0,175.3808467614441,56.04809965611611,,0,0,0,56.04809965611611,39.7287468034299,,0,0,0,39.7287468034299,120.30065093724609,,0,0,0,120.30065093724609
85,TYR,9.268990476390277,,0,0,0,9.268990476390277,5.125830152053503,,0,0,0,5.125830152053503,174.0062131005328,,0,0,0,174.0062131005328,56.1821700541403,,0,0,0,56.1821700541403,40.186437392135645,,0,0,0,40.186437392135645,126.05084670521146,,0,0,0,126.05084670521146
86,THR,8.721906662021313,,0,0,0,8.721906662021313,4.882717138683539,,0,0,0,4.882717138683539,173.31072328997666,,0,0,0,173.31072328997666,61.48178510772561,,0,0,0,61.48178510772561,69.64232837137307,,0,0,0,69.64232837137307,124.84602502213896,,0,0,0,124.84602502213896
87,SER,8.62479475916861,,0,0,0,8.62479475916861,4.143364087490287,,0,0,0,4.143364087490287,175.2233242155844,,0,0,0,175.2233242155844,58.49498197865468,,0,0,0,58.49498197865468,64.0776200614774,,0,0,0,64.0776200614774,122.33307171945833,,0,0,0,122.33307171945833
88,ALA,8.771833552181153,,0,0,0,8.771833552181153,4.613801105422356,,0,0,0,4.613801105422356,177.27182255639917,,0,0,0,177.27182255639917,51.6562114480575,,0,0,0,51.6562114480575,19.519851562193363,,0,0,0,19.519851562193363,129.71141683876678,,0,0,0,129.71141683876678
89,SER,7.949661582656233,,0,0,0,7.949661582656233,4.853304774125874,,0,0,0,4.853304774125874,174.87708902402596,,0,0,0,174.87708902402596,57.34682186461871,,0,0,0,57.34682186461871,65.39967481610611,,0,0,0,65.39967481610611,115.2691543424187,,0,0,0,115.2691543424187
90,THR,8.514675634476635,,0,0,0,8.514675634476635,4.3719623554445555,,0,0,0,4.3719623554445555,174.67038810173713,,0,0,0,174.67038810173713,62.47789018285048,,0,0,0,62.47789018285048,69.2340023553058,,0,0,0,69.2340023553058,112.97180329097569,,0,0,0,112.97180329097569