RESNUM,RESNAME,H_X,H_Y,H_BEST_REF_SCORE,H_BEST_REF_COV,H_BEST_REF_MATCH,H_UCBShift,HA_X,HA_Y,HA_BEST_REF_SCORE,HA_BEST_REF_COV,HA_BEST_REF_MATCH,HA_UCBShift,C_X,C_Y,C_BEST_REF_SCORE,C_BEST_REF_COV,C_BEST_REF_MATCH,C_UCBShift,CA_X,CA_Y,CA_BEST_REF_SCORE,CA_BEST_REF_COV,CA_BEST_REF_MATCH,CA_UCBShift,CB_X,CB_Y,CB_BEST_REF_SCORE,CB_BEST_REF_COV,CB_BEST_REF_MATCH,CB_UCBShift,N_X,N_Y,N_BEST_REF_SCORE,N_BEST_REF_COV,N_BEST_REF_MATCH,N_UCBShift
1,SER,8.428214513036963,,0,0,0,8.428214513036963,4.3476516912531915,,0,0,0,4.3476516912531915,174.00201724736928,,0,0,0,174.00201724736928,58.87541539842935,,0,0,0,58.87541539842935,63.24407537132867,,0,0,0,63.24407537132867,117.45978972244423,,0,0,0,117.45978972244423
2,HIS,8.671058367604617,,0,0,0,8.671058367604617,4.426442312753913,,0,0,0,4.426442312753913,175.19335468861138,,0,0,0,175.19335468861138,56.15111344521589,,0,0,0,56.15111344521589,28.598995633566435,,0,0,0,28.598995633566435,121.61129703086358,,0,0,0,121.61129703086358
3,MET,8.229694335275834,,0,0,0,8.229694335275834,4.279649325252525,,0,0,0,4.279649325252525,176.19308924567102,,0,0,0,176.19308924567102,55.34011160011655,,0,0,0,55.34011160011655,32.41405786046731,,0,0,0,32.41405786046731,122.99476182506382,,0,0,0,122.99476182506382
4,GLY,8.231533676062826,,0,0,0,8.231533676062826,3.8589927218420463,,0,0,0,3.8589927218420463,174.3714178436064,,0,0,0,174.3714178436064,45.25812081797647,,0,0,0,45.25812081797647,,,0,0,0,,111.6393959888778,,0,0,0,111.6393959888778
5,GLY,8.209953865934066,,0,0,0,8.209953865934066,3.815412348257298,,0,0,0,3.815412348257298,173.9845152823177,,0,0,0,173.9845152823177,45.027679323670775,,0,0,0,45.027679323670775,,,0,0,0,,110.33035612441446,,0,0,0,110.33035612441446
6,GLU,8.451852101848152,,0,0,0,8.451852101848152,4.081971354897879,,0,0,0,4.081971354897879,176.60791443209567,,0,0,0,176.60791443209567,56.318642991358644,,0,0,0,56.318642991358644,29.48476919098124,,0,0,0,29.48476919098124,122.7393282003552,,0,0,0,122.7393282003552
7,GLY,7.870829522688423,,0,0,0,7.870829522688423,3.6194582603729604,,0,0,0,3.6194582603729604,173.47349116450218,,0,0,0,173.47349116450218,44.81363909938395,,0,0,0,44.81363909938395,,,0,0,0,,110.75641877531912,,0,0,0,110.75641877531912
8,PHE,7.7971565328837835,,0,0,0,7.7971565328837835,4.5180658354367855,,0,0,0,4.5180658354367855,173.48032763234545,,0,0,0,173.48032763234545,57.43768135661006,,0,0,0,57.43768135661006,38.48223391265402,,0,0,0,38.48223391265402,121.90640041671107,,0,0,0,121.90640041671107
9,VAL,8.102604317066266,,0,0,0,8.102604317066266,5.148501624691974,,0,0,0,5.148501624691974,175.0804563038406,,0,0,0,175.0804563038406,60.09519011007326,,0,0,0,60.09519011007326,35.225679715978465,,0,0,0,35.225679715978465,123.73419127267732,,0,0,0,123.73419127267732
10,VAL,9.078815108974359,,0,0,0,9.078815108974359,5.316442420446221,,0,0,0,5.316442420446221,173.61952436879787,,0,0,0,173.61952436879787,58.569908808191805,,0,0,0,58.569908808191805,35.26544902127317,,0,0,0,35.26544902127317,122.45982716349206,,0,0,0,122.45982716349206
11,LYS,9.311748478388278,,0,0,0,9.311748478388278,4.814881757742258,,0,0,0,4.814881757742258,175.13887992030192,,0,0,0,175.13887992030192,55.51058288384394,,0,0,0,55.51058288384394,34.62049643720724,,0,0,0,34.62049643720724,126.97777101950271,,0,0,0,126.97777101950271
12,VAL,9.21716808800089,,0,0,0,9.21716808800089,5.149129798212899,,0,0,0,5.149129798212899,175.05750211451883,,0,0,0,175.05750211451883,60.76839308887779,,0,0,0,60.76839308887779,33.47511145262515,,0,0,0,33.47511145262515,127.04876415360751,,0,0,0,127.04876415360751
13,ARG,8.901425082178932,,0,0,0,8.901425082178932,5.3433103441003444,,0,0,0,5.3433103441003444,175.90143320920748,,0,0,0,175.90143320920748,54.21344324207459,,0,0,0,54.21344324207459,34.04948871682207,,0,0,0,34.04948871682207,125.55649372409813,,0,0,0,125.55649372409813
14,GLY,8.27201588891664,,0,0,0,8.27201588891664,3.953848882389832,,0,0,0,3.953848882389832,174.4492157954823,,0,0,0,174.4492157954823,45.5803008508769,,0,0,0,45.5803008508769,,,0,0,0,,108.696332043562,,0,0,0,108.696332043562
15,LEU,8.137920245221446,,0,0,0,8.137920245221446,4.2429875926545675,,0,0,0,4.2429875926545675,174.8108124965701,,0,0,0,174.8108124965701,52.95630608780109,,0,0,0,52.95630608780109,41.03884817823843,,0,0,0,41.03884817823843,121.0536157032967,,0,0,0,121.0536157032967
16,PRO,,,0,0,0,,4.321417163153513,,0,0,0,4.321417163153513,177.3471295406205,,0,0,0,177.3471295406205,62.35588721220446,,0,0,0,62.35588721220446,32.16192817019647,,0,0,0,32.16192817019647,,,0,0,0,
17,TRP,8.351885852713952,,0,0,0,8.351885852713952,4.527713313764014,,0,0,0,4.527713313764014,176.20270769482184,,0,0,0,176.20270769482184,59.21166728307248,,0,0,0,59.21166728307248,28.74240408792874,,0,0,0,28.74240408792874,122.23669430221445,,0,0,0,122.23669430221445
18,SER,8.010186241414141,,0,0,0,8.010186241414141,4.471229064352314,,0,0,0,4.471229064352314,174.68105523957152,,0,0,0,174.68105523957152,58.17349408095238,,0,0,0,58.17349408095238,63.648845836474635,,0,0,0,63.648845836474635,112.83479698369409,,0,0,0,112.83479698369409
19,CYS,7.8264051102120105,,0,0,0,7.8264051102120105,4.338727214005439,,0,0,0,4.338727214005439,174.117680695005,,0,0,0,174.117680695005,60.003376001554,,0,0,0,60.003376001554,27.53725469880675,,0,0,0,27.53725469880675,122.4079885351371,,0,0,0,122.4079885351371
20,SER,8.93988177112887,,0,0,0,8.93988177112887,4.579655812520812,,0,0,0,4.579655812520812,175.152648665318,,0,0,0,175.152648665318,57.24477014151959,,0,0,0,57.24477014151959,65.51391462416473,,0,0,0,65.51391462416473,123.59011153332779,,0,0,0,123.59011153332779
21,ALA,9.22987062950383,,0,0,0,9.22987062950383,4.030118929009879,,0,0,0,4.030118929009879,179.16921115790876,,0,0,0,179.16921115790876,56.044836217565766,,0,0,0,56.044836217565766,18.17641424610945,,0,0,0,18.17641424610945,124.9488475573593,,0,0,0,124.9488475573593
22,ASP,8.635291284354533,,0,0,0,8.635291284354533,4.476121488714063,,0,0,0,4.476121488714063,178.46825237509714,,0,0,0,178.46825237509714,57.48892389766345,,0,0,0,57.48892389766345,40.692432883727385,,0,0,0,40.692432883727385,118.3281190981685,,0,0,0,118.3281190981685
23,GLU,8.046023143889444,,0,0,0,8.046023143889444,4.1155616402097905,,0,0,0,4.1155616402097905,179.02335904855144,,0,0,0,179.02335904855144,59.38645362435897,,0,0,0,59.38645362435897,30.181798615884116,,0,0,0,30.181798615884116,120.89415740191475,,0,0,0,120.89415740191475
24,VAL,8.260642733383282,,0,0,0,8.260642733383282,3.605430717488067,,0,0,0,3.605430717488067,177.59726269865692,,0,0,0,177.59726269865692,67.20051255031635,,0,0,0,67.20051255031635,31.349921938161838,,0,0,0,31.349921938161838,120.75035358421579,,0,0,0,120.75035358421579
25,GLN,8.643518246059497,,0,0,0,8.643518246059497,3.8936684326201574,,0,0,0,3.8936684326201574,177.96341267041294,,0,0,0,177.96341267041294,59.48979663620268,,0,0,0,59.48979663620268,28.647155028016428,,0,0,0,28.647155028016428,119.15365617433122,,0,0,0,119.15365617433122
26,ARG,8.129952977694527,,0,0,0,8.129952977694527,4.088026332212232,,0,0,0,4.088026332212232,179.24351552745588,,0,0,0,179.24351552745588,58.91365897273282,,0,0,0,58.91365897273282,30.30013818967699,,0,0,0,30.30013818967699,117.94306113406593,,0,0,0,117.94306113406593
27,PHE,8.438415834176935,,0,0,0,8.438415834176935,4.129220162759462,,0,0,0,4.129220162759462,176.5137525640415,,0,0,0,176.5137525640415,61.079834299483856,,0,0,0,61.079834299483856,39.78108377343767,,0,0,0,39.78108377343767,121.94350336407481,,0,0,0,121.94350336407481
28,PHE,8.493105015806417,,0,0,0,8.493105015806417,4.512592572216672,,0,0,0,4.512592572216672,176.98455203550895,,0,0,0,176.98455203550895,58.32720948408814,,0,0,0,58.32720948408814,38.31876854992785,,0,0,0,38.31876854992785,114.5250665013875,,0,0,0,114.5250665013875
29,SER,7.701785433189033,,0,0,0,7.701785433189033,4.32299421521534,,0,0,0,4.32299421521534,175.32323367899323,,0,0,0,175.32323367899323,60.88194958558108,,0,0,0,60.88194958558108,63.53293250597736,,0,0,0,63.53293250597736,116.51498582349318,,0,0,0,116.51498582349318
30,ASP,8.462757305583306,,0,0,0,8.462757305583306,4.711385199386724,,0,0,0,4.711385199386724,175.78189906141083,,0,0,0,175.78189906141083,54.61913718575869,,0,0,0,54.61913718575869,40.32728332014097,,0,0,0,40.32728332014097,119.69448172312133,,0,0,0,119.69448172312133
31,CYS,7.883938131091131,,0,0,0,7.883938131091131,4.924592924192474,,0,0,0,4.924592924192474,173.57654243478743,,0,0,0,173.57654243478743,57.27652045637141,,0,0,0,57.27652045637141,30.59957736118326,,0,0,0,30.59957736118326,117.95537559780774,,0,0,0,117.95537559780774
32,LYS,8.76009501128871,,0,0,0,8.76009501128871,4.410492190675991,,0,0,0,4.410492190675991,175.94493086689977,,0,0,0,175.94493086689977,55.314408749112,,0,0,0,55.314408749112,32.18733329557665,,0,0,0,32.18733329557665,122.28074826772672,,0,0,0,122.28074826772672
33,ILE,8.217034608769008,,0,0,0,8.217034608769008,4.332006346708846,,0,0,0,4.332006346708846,176.81127825837495,,0,0,0,176.81127825837495,61.338615764685315,,0,0,0,61.338615764685315,38.31519896265401,,0,0,0,38.31519896265401,125.44858923818958,,0,0,0,125.44858923818958
34,GLN,8.929156191636142,,0,0,0,8.929156191636142,3.9854940957625704,,0,0,0,3.9854940957625704,175.91531916676658,,0,0,0,175.91531916676658,57.47374786060606,,0,0,0,57.47374786060606,28.31102577781108,,0,0,0,28.31102577781108,128.41532235008324,,0,0,0,128.41532235008324
35,ASN,8.91536830890221,,0,0,0,8.91536830890221,4.489517708258409,,0,0,0,4.489517708258409,175.96247697496392,,0,0,0,175.96247697496392,54.62478083746809,,0,0,0,54.62478083746809,37.909243654079255,,0,0,0,37.909243654079255,121.84698206665557,,0,0,0,121.84698206665557
36,GLY,8.148838338428238,,0,0,0,8.148838338428238,3.886093625932401,,0,0,0,3.886093625932401,175.5274738941059,,0,0,0,175.5274738941059,46.496075180508385,,0,0,0,46.496075180508385,,,0,0,0,,109.28815438116882,,0,0,0,109.28815438116882
37,ALA,8.616526293112443,,0,0,0,8.616526293112443,4.049261718012543,,0,0,0,4.049261718012543,179.44233173730714,,0,0,0,179.44233173730714,54.34609995900211,,0,0,0,54.34609995900211,18.712917796553448,,0,0,0,18.712917796553448,126.67130508692419,,0,0,0,126.67130508692419
38,GLN,8.175510885386835,,0,0,0,8.175510885386835,4.2590313475524475,,0,0,0,4.2590313475524475,176.95172291330337,,0,0,0,176.95172291330337,57.54372190183705,,0,0,0,57.54372190183705,28.332639136080584,,0,0,0,28.332639136080584,115.86643257413697,,0,0,0,115.86643257413697
39,GLY,8.060024596386947,,0,0,0,8.060024596386947,4.050666511843713,,0,0,0,4.050666511843713,173.09231326567877,,0,0,0,173.09231326567877,45.387528683039186,,0,0,0,45.387528683039186,,,0,0,0,,107.4065661012876,,0,0,0,107.4065661012876
40,ILE,7.361912791891442,,0,0,0,7.361912791891442,4.712565717071818,,0,0,0,4.712565717071818,175.70619121398047,,0,0,0,175.70619121398047,60.28333618079698,,0,0,0,60.28333618079698,38.417332854218,,0,0,0,38.417332854218,120.20996085211456,,0,0,0,120.20996085211456
41,ARG,9.048761114707515,,0,0,0,9.048761114707515,4.906476843889444,,0,0,0,4.906476843889444,175.16443528650794,,0,0,0,175.16443528650794,53.666199144527695,,0,0,0,53.666199144527695,31.39671105932401,,0,0,0,31.39671105932401,128.32301362948718,,0,0,0,128.32301362948718
42,PHE,9.05428584021534,,0,0,0,9.05428584021534,4.334466128271728,,0,0,0,4.334466128271728,175.42520881933623,,0,0,0,175.42520881933623,59.306198324403375,,0,0,0,59.306198324403375,39.8955377469142,,0,0,0,39.8955377469142,124.60462549584304,,0,0,0,124.60462549584304
43,ILE,8.794193453940505,,0,0,0,8.794193453940505,4.365957227097902,,0,0,0,4.365957227097902,175.00859363061383,,0,0,0,175.00859363061383,60.46600392039627,,0,0,0,60.46600392039627,39.03551945873016,,0,0,0,39.03551945873016,121.50608274048174,,0,0,0,121.50608274048174
44,TYR,8.87046914072594,,0,0,0,8.87046914072594,5.369399382406483,,0,0,0,5.369399382406483,176.82609165853037,,0,0,0,176.82609165853037,56.909436715984015,,0,0,0,56.909436715984015,40.798065289366185,,0,0,0,40.798065289366185,126.50216943629148,,0,0,0,126.50216943629148
45,THR,8.848585134321235,,0,0,0,8.848585134321235,4.620647687673437,,0,0,0,4.620647687673437,176.91282792888222,,0,0,0,176.91282792888222,60.91633298926629,,0,0,0,60.91633298926629,70.75208737648462,,0,0,0,70.75208737648462,112.67579736594516,,0,0,0,112.67579736594516
46,ARG,8.9124871009657,,0,0,0,8.9124871009657,4.051878724214674,,0,0,0,4.051878724214674,177.00657625344655,,0,0,0,177.00657625344655,58.63351344213009,,0,0,0,58.63351344213009,29.838274708730157,,0,0,0,29.838274708730157,121.97668713613608,,0,0,0,121.97668713613608
47,GLU,7.980700911976912,,0,0,0,7.980700911976912,4.3096645221778225,,0,0,0,4.3096645221778225,177.07621338003108,,0,0,0,177.07621338003108,56.37886348839494,,0,0,0,56.37886348839494,29.700856922433122,,0,0,0,29.700856922433122,116.62340706963037,,0,0,0,116.62340706963037
48,GLY,8.1669058503774,,0,0,0,8.1669058503774,3.9078468664252415,,0,0,0,3.9078468664252415,174.01226601521256,,0,0,0,174.01226601521256,45.39015880813076,,0,0,0,45.39015880813076,,,0,0,0,,108.99179646284826,,0,0,0,108.99179646284826
49,ARG,7.834731265728715,,0,0,0,7.834731265728715,4.779894656299256,,0,0,0,4.779894656299256,174.1265085161616,,0,0,0,174.1265085161616,53.488752996497944,,0,0,0,53.488752996497944,30.35008980346875,,0,0,0,30.35008980346875,120.91052464895105,,0,0,0,120.91052464895105
50,PRO,,,0,0,0,,4.306722427189477,,0,0,0,4.306722427189477,176.2369496770896,,0,0,0,176.2369496770896,63.36130646834277,,0,0,0,63.36130646834277,31.363832573137977,,0,0,0,31.363832573137977,,,0,0,0,
51,SER,8.805066692968143,,0,0,0,8.805066692968143,4.39818056038406,,0,0,0,4.39818056038406,175.35148410656566,,0,0,0,175.35148410656566,59.35243107892663,,0,0,0,59.35243107892663,64.07738623195138,,0,0,0,64.07738623195138,119.58307341416916,,0,0,0,119.58307341416916
52,GLY,8.355674104417805,,0,0,0,8.355674104417805,4.048563852905428,,0,0,0,4.048563852905428,172.91239836268176,,0,0,0,172.91239836268176,45.73095451404706,,0,0,0,45.73095451404706,,,0,0,0,,108.69729093757354,,0,0,0,108.69729093757354
53,GLU,7.767700293112443,,0,0,0,7.767700293112443,5.440993997197246,,0,0,0,5.440993997197246,175.30473432506938,,0,0,0,175.30473432506938,54.324411133860586,,0,0,0,54.324411133860586,33.92298056689977,,0,0,0,33.92298056689977,118.69104823199578,,0,0,0,118.69104823199578
54,ALA,8.901382656621157,,0,0,0,8.901382656621157,5.141252416011767,,0,0,0,5.141252416011767,175.08525196952493,,0,0,0,175.08525196952493,50.608550780957934,,0,0,0,50.608550780957934,23.336223223815075,,0,0,0,23.336223223815075,122.88511979891774,,0,0,0,122.88511979891774
55,PHE,9.021569815262517,,0,0,0,9.021569815262517,5.394828757786658,,0,0,0,5.394828757786658,175.36800585735378,,0,0,0,175.36800585735378,56.88270617047397,,0,0,0,56.88270617047397,42.12558388274503,,0,0,0,42.12558388274503,119.88092333437673,,0,0,0,119.88092333437673
56,VAL,9.381960134293482,,0,0,0,9.381960134293482,4.87119701053391,,0,0,0,4.87119701053391,175.0384290473693,,0,0,0,175.0384290473693,60.675001492063494,,0,0,0,60.675001492063494,34.32888486990232,,0,0,0,34.32888486990232,121.77490248659119,,0,0,0,121.77490248659119
57,GLU,8.85089922177822,,0,0,0,8.85089922177822,4.832550787473637,,0,0,0,4.832550787473637,176.33477228121876,,0,0,0,176.33477228121876,56.25035882292153,,0,0,0,56.25035882292153,30.783012083960482,,0,0,0,30.783012083960482,127.22070370496725,,0,0,0,127.22070370496725
58,LEU,9.229036669125318,,0,0,0,9.229036669125318,5.055560393334444,,0,0,0,5.055560393334444,177.32649954967255,,0,0,0,177.32649954967255,53.53565739271839,,0,0,0,53.53565739271839,43.67621248862804,,0,0,0,43.67621248862804,124.67011067766677,,0,0,0,124.67011067766677
59,GLU,8.917377624170273,,0,0,0,8.917377624170273,4.288310851831501,,0,0,0,4.288310851831501,176.01041219082583,,0,0,0,176.01041219082583,58.604025476212676,,0,0,0,58.604025476212676,30.363983165712064,,0,0,0,30.363983165712064,119.94037151909203,,0,0,0,119.94037151909203
60,SER,7.537648830436231,,0,0,0,7.537648830436231,3.66620999057054,,0,0,0,3.66620999057054,173.9789331643745,,0,0,0,173.9789331643745,57.24676320652125,,0,0,0,57.24676320652125,65.48618037448108,,0,0,0,65.48618037448108,109.65821131888113,,0,0,0,109.65821131888113
61,GLU,8.513101328532578,,0,0,0,8.513101328532578,3.7399455442612948,,0,0,0,3.7399455442612948,177.7376106141636,,0,0,0,177.7376106141636,60.23442164744699,,0,0,0,60.23442164744699,29.521308208497057,,0,0,0,29.521308208497057,122.84389401960262,,0,0,0,122.84389401960262
62,ASP,8.45305991009546,,0,0,0,8.45305991009546,4.358938760780886,,0,0,0,4.358938760780886,178.9367948825841,,0,0,0,178.9367948825841,57.29046960028305,,0,0,0,57.29046960028305,39.99898550460096,,0,0,0,39.99898550460096,117.81843099395604,,0,0,0,117.81843099395604
63,GLU,7.827836916483517,,0,0,0,7.827836916483517,4.148840000330225,,0,0,0,4.148840000330225,178.69999132702299,,0,0,0,178.69999132702299,58.628550855827505,,0,0,0,58.628550855827505,29.17254122910978,,0,0,0,29.17254122910978,120.24449129723055,,0,0,0,120.24449129723055
64,VAL,8.046896629220779,,0,0,0,8.046896629220779,3.4807888204906208,,0,0,0,3.4807888204906208,177.56906847811632,,0,0,0,177.56906847811632,67.4285051575369,,0,0,0,67.4285051575369,31.34646456916972,,0,0,0,31.34646456916972,120.72756224544345,,0,0,0,120.72756224544345
65,LYS,8.000231727994228,,0,0,0,8.000231727994228,3.9566255335830833,,0,0,0,3.9566255335830833,179.52440433517592,,0,0,0,179.52440433517592,60.127467418836716,,0,0,0,60.127467418836716,32.275689203907206,,0,0,0,32.275689203907206,120.22689488077478,,0,0,0,120.22689488077478
66,LEU,8.236421234071484,,0,0,0,8.236421234071484,4.156088177705628,,0,0,0,4.156088177705628,179.50918172801087,,0,0,0,179.50918172801087,57.67376181398046,,0,0,0,57.67376181398046,42.29328054064269,,0,0,0,42.29328054064269,120.87438522173937,,0,0,0,120.87438522173937
67,ALA,8.587345386063937,,0,0,0,8.587345386063937,4.121912762642912,,0,0,0,4.121912762642912,179.8736519469142,,0,0,0,179.8736519469142,55.474539498651346,,0,0,0,55.474539498651346,18.497626105705407,,0,0,0,18.497626105705407,122.9919727046398,,0,0,0,122.9919727046398
68,LEU,8.58264856016761,,0,0,0,8.58264856016761,4.034857136552337,,0,0,0,4.034857136552337,179.5365348230214,,0,0,0,179.5365348230214,57.380728066350315,,0,0,0,57.380728066350315,41.72570597195027,,0,0,0,41.72570597195027,118.0651550049617,,0,0,0,118.0651550049617
69,LYS,7.649566313658562,,0,0,0,7.649566313658562,4.132772881984682,,0,0,0,4.132772881984682,177.6330499543179,,0,0,0,177.6330499543179,58.6397985513764,,0,0,0,58.6397985513764,32.34979425988456,,0,0,0,32.34979425988456,117.32106042583528,,0,0,0,117.32106042583528
70,LYS,7.8094217567543565,,0,0,0,7.8094217567543565,4.2046726526251526,,0,0,0,4.2046726526251526,176.45873462777777,,0,0,0,176.45873462777777,55.57056631148851,,0,0,0,55.57056631148851,31.913935988261738,,0,0,0,31.913935988261738,116.56973806964703,,0,0,0,116.56973806964703
71,ASP,7.554984578898879,,0,0,0,7.554984578898879,4.355940540007215,,0,0,0,4.355940540007215,177.1012179834277,,0,0,0,177.1012179834277,56.22714498826174,,0,0,0,56.22714498826174,41.19183555744811,,0,0,0,41.19183555744811,120.71347793247308,,0,0,0,120.71347793247308
72,ARG,8.841097396503498,,0,0,0,8.841097396503498,4.036992010769785,,0,0,0,4.036992010769785,175.58010842918748,,0,0,0,175.58010842918748,58.2327166026751,,0,0,0,58.2327166026751,27.58228305181485,,0,0,0,27.58228305181485,121.61975367915417,,0,0,0,121.61975367915417
73,GLU,8.074063232312133,,0,0,0,8.074063232312133,4.38786603061383,,0,0,0,4.38786603061383,175.9145159899434,,0,0,0,175.9145159899434,57.041028103396606,,0,0,0,57.041028103396606,30.992923196320344,,0,0,0,30.992923196320344,120.39681755009435,,0,0,0,120.39681755009435
74,THR,8.48790294982795,,0,0,0,8.48790294982795,4.972364151626151,,0,0,0,4.972364151626151,174.24619696093905,,0,0,0,174.24619696093905,61.51829462510822,,0,0,0,61.51829462510822,69.6339905060606,,0,0,0,69.6339905060606,115.8706602005106,,0,0,0,115.8706602005106
75,MET,8.979010162376511,,0,0,0,8.979010162376511,4.635731775102675,,0,0,0,4.635731775102675,176.01806087989235,,0,0,0,176.01806087989235,54.0727391499667,,0,0,0,54.0727391499667,32.81066055192585,,0,0,0,32.81066055192585,126.98521793493174,,0,0,0,126.98521793493174
76,GLY,9.02165452048507,,0,0,0,9.02165452048507,3.8279955368603624,,0,0,0,3.8279955368603624,174.7553507926296,,0,0,0,174.7553507926296,46.897118191941395,,0,0,0,46.897118191941395,,,0,0,0,,116.34277924130313,,0,0,0,116.34277924130313
77,HIS,8.862056414041515,,0,0,0,8.862056414041515,4.539671411127761,,0,0,0,4.539671411127761,174.12369025457875,,0,0,0,174.12369025457875,55.94276695961261,,0,0,0,55.94276695961261,29.41601041899767,,0,0,0,29.41601041899767,123.16510102614608,,0,0,0,123.16510102614608
78,ARG,7.62924772897658,,0,0,0,7.62924772897658,4.530361450849151,,0,0,0,4.530361450849151,174.59115330949052,,0,0,0,174.59115330949052,54.648680779215226,,0,0,0,54.648680779215226,32.3565360004218,,0,0,0,32.3565360004218,120.36981925201465,,0,0,0,120.36981925201465
79,TYR,8.655505425735376,,0,0,0,8.655505425735376,4.8831234054001555,,0,0,0,4.8831234054001555,175.9466587521534,,0,0,0,175.9466587521534,58.49999091867577,,0,0,0,58.49999091867577,38.91672251934177,,0,0,0,38.91672251934177,123.30926258972138,,0,0,0,123.30926258972138
80,VAL,8.7760533491231,,0,0,0,8.7760533491231,4.649116240659341,,0,0,0,4.649116240659341,175.16969463664114,,0,0,0,175.16969463664114,61.57966603046398,,0,0,0,61.57966603046398,32.920289991713844,,0,0,0,32.920289991713844,125.06513537379843,,0,0,0,125.06513537379843
81,GLU,8.83050108038073,,0,0,0,8.83050108038073,4.518036975790875,,0,0,0,4.518036975790875,175.15461538000886,,0,0,0,175.15461538000886,55.10740836226551,,0,0,0,55.10740836226551,31.866094483238985,,0,0,0,31.866094483238985,127.6712025011433,,0,0,0,127.6712025011433
82,VAL,8.380612676767676,,0,0,0,8.380612676767676,4.734093396475746,,0,0,0,4.734093396475746,174.38197061998002,,0,0,0,174.38197061998002,61.357917879825735,,0,0,0,61.357917879825735,33.76834904030414,,0,0,0,33.76834904030414,123.39426903243978,,0,0,0,123.39426903243978
83,PHE,9.364453427988678,,0,0,0,9.364453427988678,4.9036632184482185,,0,0,0,4.9036632184482185,174.70882466874792,,0,0,0,174.70882466874792,56.339947223809524,,0,0,0,56.339947223809524,41.884656844422246,,0,0,0,41.884656844422246,125.1722495022977,,0,0,0,125.1722495022977
84,LYS,9.066948611177711,,0,0,0,9.066948611177711,4.323279825879676,,0,0,0,4.323279825879676,175.82412363596404,,0,0,0,175.82412363596404,57.31873074812965,,0,0,0,57.31873074812965,33.138590462187814,,0,0,0,33.138590462187814,124.1374834837163,,0,0,0,124.1374834837163
85,SER,9.035129542712843,,0,0,0,9.035129542712843,4.824277644666445,,0,0,0,4.824277644666445,172.93703486654456,,0,0,0,172.93703486654456,56.765901766799864,,0,0,0,56.765901766799864,65.27116588891109,,0,0,0,65.27116588891109,120.91819662009657,,0,0,0,120.91819662009657
86,ASN,8.504137905355757,,0,0,0,8.504137905355757,5.154612570695972,,0,0,0,5.154612570695972,175.96238269351204,,0,0,0,175.96238269351204,52.32394043812299,,0,0,0,52.32394043812299,41.0906395953713,,0,0,0,41.0906395953713,118.84346892881008,,0,0,0,118.84346892881008
87,ASN,8.829769163197913,,0,0,0,8.829769163197913,4.169824730264181,,0,0,0,4.169824730264181,176.64526846472415,,0,0,0,176.64526846472415,56.31421160841936,,0,0,0,56.31421160841936,37.90971090858586,,0,0,0,37.90971090858586,120.10238003398824,,0,0,0,120.10238003398824
88,VAL,8.136426085897435,,0,0,0,8.136426085897435,3.7058638785575533,,0,0,0,3.7058638785575533,177.74349547506938,,0,0,0,177.74349547506938,65.98835948293373,,0,0,0,65.98835948293373,31.69498754041514,,0,0,0,31.69498754041514,119.20564728293374,,0,0,0,119.20564728293374
89,GLU,7.724741354978355,,0,0,0,7.724741354978355,4.117649247818848,,0,0,0,4.117649247818848,178.47699920188145,,0,0,0,178.47699920188145,59.00171347521368,,0,0,0,59.00171347521368,29.848211273359972,,0,0,0,29.848211273359972,121.25643915304695,,0,0,0,121.25643915304695