RESNUM,RESNAME,H_X,H_Y,H_BEST_REF_SCORE,H_BEST_REF_COV,H_BEST_REF_MATCH,H_UCBShift,HA_X,HA_Y,HA_BEST_REF_SCORE,HA_BEST_REF_COV,HA_BEST_REF_MATCH,HA_UCBShift,C_X,C_Y,C_BEST_REF_SCORE,C_BEST_REF_COV,C_BEST_REF_MATCH,C_UCBShift,CA_X,CA_Y,CA_BEST_REF_SCORE,CA_BEST_REF_COV,CA_BEST_REF_MATCH,CA_UCBShift,CB_X,CB_Y,CB_BEST_REF_SCORE,CB_BEST_REF_COV,CB_BEST_REF_MATCH,CB_UCBShift,N_X,N_Y,N_BEST_REF_SCORE,N_BEST_REF_COV,N_BEST_REF_MATCH,N_UCBShift
1,MET,8.332570979692528,,0,0,0,8.332570979692528,4.394277038639139,,0,0,0,4.394277038639139,175.9660205912088,,0,0,0,175.9660205912088,55.40995961617826,,0,0,0,55.40995961617826,32.92057183770119,,0,0,0,32.92057183770119,121.33482138682427,,0,0,0,121.33482138682427
2,GLY,8.357388615412365,,0,0,0,8.357388615412365,3.7712364275974033,,0,0,0,3.7712364275974033,173.499227151665,,0,0,0,173.499227151665,44.932753616605616,,0,0,0,44.932753616605616,,,0,0,0,,111.22562509781885,,0,0,0,111.22562509781885
3,HIS,8.449444716267067,,0,0,0,8.449444716267067,4.53381489074259,,0,0,0,4.53381489074259,174.12720079414473,,0,0,0,174.12720079414473,55.85737492203352,,0,0,0,55.85737492203352,30.57215417070707,,0,0,0,30.57215417070707,118.32263296587857,,0,0,0,118.32263296587857
4,HIS,8.603067658996558,,0,0,0,8.603067658996558,4.295843752253302,,0,0,0,4.295843752253302,174.1013600230214,,0,0,0,174.1013600230214,55.57510259901765,,0,0,0,55.57510259901765,29.23496644109224,,0,0,0,29.23496644109224,119.89780129110889,,0,0,0,119.89780129110889
5,HIS,8.38889743013653,,0,0,0,8.38889743013653,4.362833387140637,,0,0,0,4.362833387140637,174.15268105021644,,0,0,0,174.15268105021644,55.62177984120324,,0,0,0,55.62177984120324,30.457103843728493,,0,0,0,30.457103843728493,120.09902732527473,,0,0,0,120.09902732527473
6,HIS,8.498028585658785,,0,0,0,8.498028585658785,4.420453457181707,,0,0,0,4.420453457181707,174.570792788345,,0,0,0,174.570792788345,56.02848018583084,,0,0,0,56.02848018583084,30.05009026061161,,0,0,0,30.05009026061161,120.91748155437341,,0,0,0,120.91748155437341
7,HIS,8.436460248151848,,0,0,0,8.436460248151848,4.535587446292596,,0,0,0,4.535587446292596,174.07681294421133,,0,0,0,174.07681294421133,55.25060023773449,,0,0,0,55.25060023773449,29.70872823953824,,0,0,0,29.70872823953824,121.98200555226441,,0,0,0,121.98200555226441
8,HIS,8.374558033782884,,0,0,0,8.374558033782884,4.386731476795427,,0,0,0,4.386731476795427,174.71540884839604,,0,0,0,174.71540884839604,55.7379863959485,,0,0,0,55.7379863959485,29.13769263035853,,0,0,0,29.13769263035853,121.1596020940504,,0,0,0,121.1596020940504
9,SER,8.143903175441226,,0,0,0,8.143903175441226,4.461052980852481,,0,0,0,4.461052980852481,174.22980544257965,,0,0,0,174.22980544257965,58.40492682711732,,0,0,0,58.40492682711732,63.200802654317904,,0,0,0,63.200802654317904,119.187114346781,,0,0,0,119.187114346781
10,HIS,8.22676747951493,,0,0,0,8.22676747951493,4.4543694503552,,0,0,0,4.4543694503552,175.12286222011878,,0,0,0,175.12286222011878,55.735739986996336,,0,0,0,55.735739986996336,29.101654073409925,,0,0,0,29.101654073409925,121.45264878664113,,0,0,0,121.45264878664113
11,MET,8.328265016572315,,0,0,0,8.328265016572315,4.395844189890664,,0,0,0,4.395844189890664,176.1102326708514,,0,0,0,176.1102326708514,55.24899219282939,,0,0,0,55.24899219282939,32.2238047974248,,0,0,0,32.2238047974248,122.658473662876,,0,0,0,122.658473662876
12,GLY,8.159388114246864,,0,0,0,8.159388114246864,3.9135669668220663,,0,0,0,3.9135669668220663,174.13422617037963,,0,0,0,174.13422617037963,44.87645310404041,,0,0,0,44.87645310404041,,,0,0,0,,110.8177192953047,,0,0,0,110.8177192953047
13,SER,8.492400165390166,,0,0,0,8.492400165390166,4.510911582667332,,0,0,0,4.510911582667332,175.31180933843933,,0,0,0,175.31180933843933,57.97098240266955,,0,0,0,57.97098240266955,64.56457777878232,,0,0,0,64.56457777878232,117.90779289196914,,0,0,0,117.90779289196914
14,GLU,9.008485046830947,,0,0,0,9.008485046830947,4.048192972843823,,0,0,0,4.048192972843823,178.6610928070041,,0,0,0,178.6610928070041,59.83331345653236,,0,0,0,59.83331345653236,29.242574303729604,,0,0,0,29.242574303729604,123.63766966669442,,0,0,0,123.63766966669442
15,GLU,8.899630162487513,,0,0,0,8.899630162487513,4.135459458696859,,0,0,0,4.135459458696859,178.516533046448,,0,0,0,178.516533046448,59.39116627104562,,0,0,0,59.39116627104562,29.41393645825286,,0,0,0,29.41393645825286,119.23043713251748,,0,0,0,119.23043713251748
16,ASP,8.053066870906871,,0,0,0,8.053066870906871,4.567963996514597,,0,0,0,4.567963996514597,178.25666726256523,,0,0,0,178.25666726256523,57.51096291673327,,0,0,0,57.51096291673327,41.05232468673549,,0,0,0,41.05232468673549,120.89249547892108,,0,0,0,120.89249547892108
17,ASP,8.438212876495726,,0,0,0,8.438212876495726,4.437374902969253,,0,0,0,4.437374902969253,178.4561303716395,,0,0,0,178.4561303716395,57.32135559930625,,0,0,0,57.32135559930625,40.474485555833056,,0,0,0,40.474485555833056,118.73230923929404,,0,0,0,118.73230923929404
18,GLY,8.067222131585082,,0,0,0,8.067222131585082,3.8448365428377183,,0,0,0,3.8448365428377183,176.60952712000778,,0,0,0,176.60952712000778,46.772810897374846,,0,0,0,46.772810897374846,,,0,0,0,,108.98628834988345,,0,0,0,108.98628834988345
19,VAL,7.89504988137973,,0,0,0,7.89504988137973,3.5789939536657798,,0,0,0,3.5789939536657798,177.65977343239538,,0,0,0,177.65977343239538,66.58548596336996,,0,0,0,66.58548596336996,31.86868857917638,,0,0,0,31.86868857917638,122.50306639161394,,0,0,0,122.50306639161394
20,VAL,8.604359148340547,,0,0,0,8.604359148340547,3.2387480832029083,,0,0,0,3.2387480832029083,178.24757958233434,,0,0,0,178.24757958233434,66.67707772360417,,0,0,0,66.67707772360417,31.403230342829392,,0,0,0,31.403230342829392,120.85163562363748,,0,0,0,120.85163562363748
21,ALA,8.070406167127318,,0,0,0,8.070406167127318,3.926493943348319,,0,0,0,3.926493943348319,180.47972272264403,,0,0,0,180.47972272264403,55.38521764871795,,0,0,0,55.38521764871795,17.785590371756026,,0,0,0,17.785590371756026,122.98910003586968,,0,0,0,122.98910003586968
22,MET,7.894942175263624,,0,0,0,7.894942175263624,4.014466422527472,,0,0,0,4.014466422527472,178.84039932945944,,0,0,0,178.84039932945944,59.333134937562434,,0,0,0,59.333134937562434,32.97619921817627,,0,0,0,32.97619921817627,118.31574916016206,,0,0,0,118.31574916016206
23,ILE,8.49618694115329,,0,0,0,8.49618694115329,3.367939966061716,,0,0,0,3.367939966061716,177.84664707649574,,0,0,0,177.84664707649574,65.32327781531802,,0,0,0,65.32327781531802,37.940842897308244,,0,0,0,37.940842897308244,120.7940929501332,,0,0,0,120.7940929501332
24,LYS,8.472914658835608,,0,0,0,8.472914658835608,3.660269258413809,,0,0,0,3.660269258413809,178.7823531346154,,0,0,0,178.7823531346154,60.54087855651571,,0,0,0,60.54087855651571,32.305330384937285,,0,0,0,32.305330384937285,119.14098229818515,,0,0,0,119.14098229818515
25,GLU,8.032932095249196,,0,0,0,8.032932095249196,4.020604440850816,,0,0,0,4.020604440850816,179.6964809586136,,0,0,0,179.6964809586136,59.34849576867022,,0,0,0,59.34849576867022,29.513421796409148,,0,0,0,29.513421796409148,119.77427727456433,,0,0,0,119.77427727456433
26,LEU,8.148044053740703,,0,0,0,8.148044053740703,3.9548716383838385,,0,0,0,3.9548716383838385,179.76990999116992,,0,0,0,179.76990999116992,57.85483234960595,,0,0,0,57.85483234960595,42.27777534727495,,0,0,0,42.27777534727495,121.38549111259296,,0,0,0,121.38549111259296
27,LEU,8.653940013764014,,0,0,0,8.653940013764014,3.8997918112887113,,0,0,0,3.8997918112887113,178.9881012232989,,0,0,0,178.9881012232989,58.09918615309135,,0,0,0,58.09918615309135,41.37797370396825,,0,0,0,41.37797370396825,120.8250867096237,,0,0,0,120.8250867096237
28,ASP,8.442290832967032,,0,0,0,8.442290832967032,4.409410388031413,,0,0,0,4.409410388031413,178.10608553807305,,0,0,0,178.10608553807305,57.16620145577756,,0,0,0,57.16620145577756,41.07113981180486,,0,0,0,41.07113981180486,120.21430538297258,,0,0,0,120.21430538297258
29,THR,8.006416185098235,,0,0,0,8.006416185098235,4.213322814185814,,0,0,0,4.213322814185814,175.84423070084915,,0,0,0,175.84423070084915,63.30775026224886,,0,0,0,63.30775026224886,69.81715888674104,,0,0,0,69.81715888674104,110.26890381638361,,0,0,0,110.26890381638361
30,ARG,7.751136211932512,,0,0,0,7.751136211932512,4.484280374358974,,0,0,0,4.484280374358974,177.253981019253,,0,0,0,177.253981019253,57.331045999572645,,0,0,0,57.331045999572645,32.11318857881563,,0,0,0,32.11318857881563,120.80820464514375,,0,0,0,120.80820464514375
31,ILE,8.054435579037628,,0,0,0,8.054435579037628,3.724101748273949,,0,0,0,3.724101748273949,177.56099506835386,,0,0,0,177.56099506835386,64.57500102299367,,0,0,0,64.57500102299367,37.90902491785437,,0,0,0,37.90902491785437,120.38423190839161,,0,0,0,120.38423190839161
32,ARG,8.69208248077478,,0,0,0,8.69208248077478,4.070635313111889,,0,0,0,4.070635313111889,175.23444310062715,,0,0,0,175.23444310062715,61.86342558114107,,0,0,0,61.86342558114107,27.309164868237318,,0,0,0,27.309164868237318,121.61361043620823,,0,0,0,121.61361043620823
33,PRO,,,0,0,0,,4.351479991452992,,0,0,0,4.351479991452992,179.0170906534077,,0,0,0,179.0170906534077,65.7683225545066,,0,0,0,65.7683225545066,30.8174123963259,,0,0,0,30.8174123963259,,,0,0,0,
34,THR,7.624813064269064,,0,0,0,7.624813064269064,4.0375926764707515,,0,0,0,4.0375926764707515,177.19394125534464,,0,0,0,177.19394125534464,66.49878107095127,,0,0,0,66.49878107095127,68.44844483210679,,0,0,0,68.44844483210679,116.15764204087579,,0,0,0,116.15764204087579
35,VAL,8.499952106088356,,0,0,0,8.499952106088356,3.6309655412254407,,0,0,0,3.6309655412254407,178.3395724958819,,0,0,0,178.3395724958819,66.81450777834942,,0,0,0,66.81450777834942,31.566118135836387,,0,0,0,31.566118135836387,122.57107545758686,,0,0,0,122.57107545758686
36,GLN,8.48464217064602,,0,0,0,8.48464217064602,4.45598221996892,,0,0,0,4.45598221996892,180.11081266013986,,0,0,0,180.11081266013986,58.669888126051724,,0,0,0,58.669888126051724,28.586486647002996,,0,0,0,28.586486647002996,122.11368431575092,,0,0,0,122.11368431575092
37,GLU,8.360756336519037,,0,0,0,8.360756336519037,4.09840499522977,,0,0,0,4.09840499522977,177.93991906026196,,0,0,0,177.93991906026196,59.026138210361864,,0,0,0,59.026138210361864,29.285138216167166,,0,0,0,29.285138216167166,121.89290825658786,,0,0,0,121.89290825658786
38,ASP,7.840668292962593,,0,0,0,7.840668292962593,4.668161649053724,,0,0,0,4.668161649053724,176.54336124769677,,0,0,0,176.54336124769677,53.806721220657124,,0,0,0,53.806721220657124,41.11765037264957,,0,0,0,41.11765037264957,117.7121305431624,,0,0,0,117.7121305431624
39,GLY,7.956403266489066,,0,0,0,7.956403266489066,4.048105393509268,,0,0,0,4.048105393509268,173.8984952278444,,0,0,0,173.8984952278444,45.66568224966145,,0,0,0,45.66568224966145,,,0,0,0,,108.25990354109778,,0,0,0,108.25990354109778
40,GLY,8.346255841369741,,0,0,0,8.346255841369741,4.11035124057609,,0,0,0,4.11035124057609,172.73769123751248,,0,0,0,172.73769123751248,44.308138383810636,,0,0,0,44.308138383810636,,,0,0,0,,108.60142609039849,,0,0,0,108.60142609039849
41,ASP,8.683857114990564,,0,0,0,8.683857114990564,5.044880744688645,,0,0,0,5.044880744688645,174.43589371434123,,0,0,0,174.43589371434123,53.460449568642474,,0,0,0,53.460449568642474,44.816138212370966,,0,0,0,44.816138212370966,118.97081766082806,,0,0,0,118.97081766082806
42,VAL,8.706098892180043,,0,0,0,8.706098892180043,4.905805604095903,,0,0,0,4.905805604095903,173.15051670836385,,0,0,0,173.15051670836385,59.38930413473194,,0,0,0,59.38930413473194,34.50110934292374,,0,0,0,34.50110934292374,121.6972723008547,,0,0,0,121.6972723008547
43,ILE,9.002191062876014,,0,0,0,9.002191062876014,4.443138092307692,,0,0,0,4.443138092307692,175.24344467199467,,0,0,0,175.24344467199467,60.09947086541791,,0,0,0,60.09947086541791,40.54558632429237,,0,0,0,40.54558632429237,125.72255177097902,,0,0,0,125.72255177097902
44,TYR,9.042439885841935,,0,0,0,9.042439885841935,4.6587402814352314,,0,0,0,4.6587402814352314,175.0122249878011,,0,0,0,175.0122249878011,59.936799145559995,,0,0,0,59.936799145559995,38.42113631292041,,0,0,0,38.42113631292041,128.26621553164057,,0,0,0,128.26621553164057
45,LYS,8.655703356016206,,0,0,0,8.655703356016206,4.29485378979909,,0,0,0,4.29485378979909,176.01506005346874,,0,0,0,176.01506005346874,55.65843510739816,,0,0,0,55.65843510739816,33.8731605484571,,0,0,0,33.8731605484571,127.01284444100345,,0,0,0,127.01284444100345
46,GLY,7.25378155996226,,0,0,0,7.25378155996226,4.07029706490454,,0,0,0,4.07029706490454,171.27775112186146,,0,0,0,171.27775112186146,45.48736772118992,,0,0,0,45.48736772118992,,,0,0,0,,105.10221202543012,,0,0,0,105.10221202543012
47,PHE,8.643509387706738,,0,0,0,8.643509387706738,5.729659038444888,,0,0,0,5.729659038444888,173.1400846501998,,0,0,0,173.1400846501998,56.69102103097458,,0,0,0,56.69102103097458,41.85967862196137,,0,0,0,41.85967862196137,121.54429172550782,,0,0,0,121.54429172550782
48,GLU,8.423596709756909,,0,0,0,8.423596709756909,4.516576533533133,,0,0,0,4.516576533533133,176.02692383778444,,0,0,0,176.02692383778444,55.82533247293817,,0,0,0,55.82533247293817,32.377978867027416,,0,0,0,32.377978867027416,127.25883692005772,,0,0,0,127.25883692005772
49,ASP,8.96811882873238,,0,0,0,8.96811882873238,4.21401209070374,,0,0,0,4.21401209070374,175.47127680286937,,0,0,0,175.47127680286937,55.343007351665,,0,0,0,55.343007351665,40.56435379846265,,0,0,0,40.56435379846265,125.47202240875791,,0,0,0,125.47202240875791
50,GLY,7.921968414968365,,0,0,0,7.921968414968365,3.955486182326008,,0,0,0,3.955486182326008,173.19766091839273,,0,0,0,173.19766091839273,45.49585390816406,,0,0,0,45.49585390816406,,,0,0,0,,102.95585132215007,,0,0,0,102.95585132215007
51,ILE,7.7452465686313685,,0,0,0,7.7452465686313685,4.553051032545233,,0,0,0,4.553051032545233,176.22181067468642,,0,0,0,176.22181067468642,59.238862153024755,,0,0,0,59.238862153024755,37.65133213110778,,0,0,0,37.65133213110778,122.1477879956044,,0,0,0,122.1477879956044
52,VAL,9.350319033100233,,0,0,0,9.350319033100233,4.519138528271728,,0,0,0,4.519138528271728,175.47282963532024,,0,0,0,175.47282963532024,62.49270365718171,,0,0,0,62.49270365718171,32.419181098096345,,0,0,0,32.419181098096345,130.0267096553724,,0,0,0,130.0267096553724
53,GLN,8.890540606909758,,0,0,0,8.890540606909758,4.91271779085359,,0,0,0,4.91271779085359,174.8924833426518,,0,0,0,174.8924833426518,55.11090145973471,,0,0,0,55.11090145973471,29.776750347441446,,0,0,0,29.776750347441446,127.76648489637029,,0,0,0,127.76648489637029
54,LEU,9.235318305411255,,0,0,0,9.235318305411255,5.159544308963259,,0,0,0,5.159544308963259,175.8349931857809,,0,0,0,175.8349931857809,52.97005324412254,,0,0,0,52.97005324412254,45.442758874209126,,0,0,0,45.442758874209126,125.95191970314686,,0,0,0,125.95191970314686
55,LYS,9.06082545914641,,0,0,0,9.06082545914641,4.8514026056499056,,0,0,0,4.8514026056499056,175.67371889526584,,0,0,0,175.67371889526584,55.26223530535576,,0,0,0,55.26223530535576,33.656501702347654,,0,0,0,33.656501702347654,123.1540980964813,,0,0,0,123.1540980964813
56,LEU,8.93879441112776,,0,0,0,8.93879441112776,4.973501441147741,,0,0,0,4.973501441147741,176.24334783169053,,0,0,0,176.24334783169053,54.341551127189476,,0,0,0,54.341551127189476,43.90675917777778,,0,0,0,43.90675917777778,127.91645077251083,,0,0,0,127.91645077251083
57,GLN,8.863283668553668,,0,0,0,8.863283668553668,4.947934802902653,,0,0,0,4.947934802902653,175.39450653545344,,0,0,0,175.39450653545344,53.983788214180265,,0,0,0,53.983788214180265,32.51694679655344,,0,0,0,32.51694679655344,120.56171544185814,,0,0,0,120.56171544185814
58,GLY,8.677260048046398,,0,0,0,8.677260048046398,4.265908423570874,,0,0,0,4.265908423570874,175.30522311778222,,0,0,0,175.30522311778222,44.64446077909313,,0,0,0,44.64446077909313,,,0,0,0,,108.87630982380952,,0,0,0,108.87630982380952
59,SER,8.675645324719724,,0,0,0,8.675645324719724,4.250840703152403,,0,0,0,4.250840703152403,176.22999079374515,,0,0,0,176.22999079374515,60.6710281566045,,0,0,0,60.6710281566045,63.354185327861025,,0,0,0,63.354185327861025,116.23023928220668,,0,0,0,116.23023928220668
60,CYS,8.248269848579199,,0,0,0,8.248269848579199,4.4509757732600725,,0,0,0,4.4509757732600725,175.07296085354645,,0,0,0,175.07296085354645,59.484060497280495,,0,0,0,59.484060497280495,27.57734506818182,,0,0,0,27.57734506818182,118.38288673333334,,0,0,0,118.38288673333334
61,THR,7.781217846015096,,0,0,0,7.781217846015096,4.206045476867577,,0,0,0,4.206045476867577,175.20723055350203,,0,0,0,175.20723055350203,64.53352032289378,,0,0,0,64.53352032289378,68.92893062267177,,0,0,0,68.92893062267177,112.18139004093683,,0,0,0,112.18139004093683
62,SER,7.744867544622045,,0,0,0,7.744867544622045,4.409843968043067,,0,0,0,4.409843968043067,174.35630375402928,,0,0,0,174.35630375402928,58.944188416655564,,0,0,0,58.944188416655564,63.670248246559,,0,0,0,63.670248246559,115.51108570270286,,0,0,0,115.51108570270286
63,CYS,7.720314351165502,,0,0,0,7.720314351165502,4.9058857278721275,,0,0,0,4.9058857278721275,173.9383077407648,,0,0,0,173.9383077407648,56.01086090532245,,0,0,0,56.01086090532245,27.400689193661897,,0,0,0,27.400689193661897,122.67689071586192,,0,0,0,122.67689071586192
64,PRO,,,0,0,0,,4.299548181163281,,0,0,0,4.299548181163281,179.02284207807193,,0,0,0,179.02284207807193,65.42567669818514,,0,0,0,65.42567669818514,32.15030748263958,,0,0,0,32.15030748263958,,,0,0,0,
65,SER,8.547976865440116,,0,0,0,8.547976865440116,4.386951788472638,,0,0,0,4.386951788472638,177.01747172504716,,0,0,0,177.01747172504716,61.28933238495948,,0,0,0,61.28933238495948,62.747635615634366,,0,0,0,62.747635615634366,114.58316362851593,,0,0,0,114.58316362851593
66,SER,7.950951858480409,,0,0,0,7.950951858480409,4.345288481712732,,0,0,0,4.345288481712732,176.57888085154843,,0,0,0,176.57888085154843,61.46142981741591,,0,0,0,61.46142981741591,63.48502634046509,,0,0,0,63.48502634046509,119.3676303993673,,0,0,0,119.3676303993673
67,ILE,8.040364818592519,,0,0,0,8.040364818592519,3.4795158812187825,,0,0,0,3.4795158812187825,177.5923169403319,,0,0,0,177.5923169403319,65.75185651925297,,0,0,0,65.75185651925297,37.803847095204794,,0,0,0,37.803847095204794,122.84997216339217,,0,0,0,122.84997216339217
68,ILE,8.14392752895993,,0,0,0,8.14392752895993,3.6527829168886683,,0,0,0,3.6527829168886683,178.4764587352814,,0,0,0,178.4764587352814,65.2044696056832,,0,0,0,65.2044696056832,38.06728192580197,,0,0,0,38.06728192580197,120.82858909486625,,0,0,0,120.82858909486625
69,THR,8.093736837873239,,0,0,0,8.093736837873239,4.0925201477133974,,0,0,0,4.0925201477133974,176.69101545007214,,0,0,0,176.69101545007214,66.77523009365635,,0,0,0,66.77523009365635,68.45312535906871,,0,0,0,68.45312535906871,118.60488434694194,,0,0,0,118.60488434694194
70,LEU,8.450604816300366,,0,0,0,8.450604816300366,4.166815727838828,,0,0,0,4.166815727838828,179.13993040001108,,0,0,0,179.13993040001108,57.20939085526141,,0,0,0,57.20939085526141,41.58561262580753,,0,0,0,41.58561262580753,122.98831885763126,,0,0,0,122.98831885763126
71,LYS,8.587460941458541,,0,0,0,8.587460941458541,3.8074095711288707,,0,0,0,3.8074095711288707,178.4477407696581,,0,0,0,178.4477407696581,60.518898447563544,,0,0,0,60.518898447563544,32.27254164451659,,0,0,0,32.27254164451659,120.3910618379676,,0,0,0,120.3910618379676
72,ASN,8.45026139035964,,0,0,0,8.45026139035964,4.444002631268732,,0,0,0,4.444002631268732,178.01165976536797,,0,0,0,178.01165976536797,56.23948723830614,,0,0,0,56.23948723830614,38.23467061010656,,0,0,0,38.23467061010656,117.48329335578866,,0,0,0,117.48329335578866
73,GLY,8.18518994937285,,0,0,0,8.18518994937285,3.9630573459790206,,0,0,0,3.9630573459790206,176.613507207548,,0,0,0,176.613507207548,46.7870809491786,,0,0,0,46.7870809491786,,,0,0,0,,109.82759317491397,,0,0,0,109.82759317491397
74,ILE,8.530238812515263,,0,0,0,8.530238812515263,3.704106856637806,,0,0,0,3.704106856637806,177.71460475276945,,0,0,0,177.71460475276945,65.71255555305251,,0,0,0,65.71255555305251,38.081173516921965,,0,0,0,38.081173516921965,123.33303079523255,,0,0,0,123.33303079523255
75,GLN,8.924381884049284,,0,0,0,8.924381884049284,3.8562427256021756,,0,0,0,3.8562427256021756,178.21024129356755,,0,0,0,178.21024129356755,59.90492047677878,,0,0,0,59.90492047677878,28.690090372422024,,0,0,0,28.690090372422024,120.25484860641025,,0,0,0,120.25484860641025
76,ASN,8.253825071284272,,0,0,0,8.253825071284272,4.4793462995116,,0,0,0,4.4793462995116,178.03784329101452,,0,0,0,178.03784329101452,56.256836104789656,,0,0,0,56.256836104789656,38.38525733519813,,0,0,0,38.38525733519813,118.61449580956821,,0,0,0,118.61449580956821
77,MET,8.147994153069153,,0,0,0,8.147994153069153,4.186197589099789,,0,0,0,4.186197589099789,178.8601927816628,,0,0,0,178.8601927816628,59.31697350377955,,0,0,0,59.31697350377955,33.40390401778777,,0,0,0,33.40390401778777,119.93566663699077,,0,0,0,119.93566663699077
78,LEU,8.762215222183372,,0,0,0,8.762215222183372,4.055621501354202,,0,0,0,4.055621501354202,179.00541943139638,,0,0,0,179.00541943139638,57.953605303596404,,0,0,0,57.953605303596404,41.53792159998335,,0,0,0,41.53792159998335,120.7927274525863,,0,0,0,120.7927274525863
79,GLN,8.45162587078477,,0,0,0,8.45162587078477,4.093857724347874,,0,0,0,4.093857724347874,177.92559750031634,,0,0,0,177.92559750031634,58.81151399072039,,0,0,0,58.81151399072039,28.921774277561326,,0,0,0,28.921774277561326,118.70039920874126,,0,0,0,118.70039920874126
80,PHE,7.937210366106116,,0,0,0,7.937210366106116,4.1086807045759794,,0,0,0,4.1086807045759794,176.7777370857254,,0,0,0,176.7777370857254,60.410876300826956,,0,0,0,60.410876300826956,39.24749756703852,,0,0,0,39.24749756703852,118.97743450586636,,0,0,0,118.97743450586636
81,TYR,7.921560699789099,,0,0,0,7.921560699789099,4.396834147552448,,0,0,0,4.396834147552448,176.52561455959042,,0,0,0,176.52561455959042,59.337915371844815,,0,0,0,59.337915371844815,40.07792949504384,,0,0,0,40.07792949504384,115.85549225613275,,0,0,0,115.85549225613275
82,ILE,8.175463141791543,,0,0,0,8.175463141791543,4.422814290834165,,0,0,0,4.422814290834165,174.34638564286269,,0,0,0,174.34638564286269,57.976602589671444,,0,0,0,57.976602589671444,38.4232135438617,,0,0,0,38.4232135438617,119.74242619289045,,0,0,0,119.74242619289045
83,PRO,,,0,0,0,,4.42603020560273,,0,0,0,4.42603020560273,178.00113829766346,,0,0,0,178.00113829766346,64.76638527375957,,0,0,0,64.76638527375957,31.735540749556,,0,0,0,31.735540749556,,,0,0,0,
84,GLU,9.167298542463092,,0,0,0,9.167298542463092,4.250243922183372,,0,0,0,4.250243922183372,176.68403752791096,,0,0,0,176.68403752791096,57.29066447000222,,0,0,0,57.29066447000222,29.22654369202464,,0,0,0,29.22654369202464,117.55496633709069,,0,0,0,117.55496633709069
85,VAL,7.661166909595959,,0,0,0,7.661166909595959,4.12068677047952,,0,0,0,4.12068677047952,175.71051661455766,,0,0,0,175.71051661455766,62.92642715971806,,0,0,0,62.92642715971806,31.814598244705294,,0,0,0,31.814598244705294,121.1597373492452,,0,0,0,121.1597373492452
86,GLU,8.960671417682317,,0,0,0,8.960671417682317,4.386519245976245,,0,0,0,4.386519245976245,176.68038623453214,,0,0,0,176.68038623453214,57.503546503812856,,0,0,0,57.503546503812856,31.183035956748807,,0,0,0,31.183035956748807,126.27524135365745,,0,0,0,126.27524135365745
87,GLY,8.487712250777001,,0,0,0,8.487712250777001,4.204263852960928,,0,0,0,4.204263852960928,171.82923632787214,,0,0,0,171.82923632787214,45.3406999049062,,0,0,0,45.3406999049062,,,0,0,0,,106.6039083061827,,0,0,0,106.6039083061827
88,VAL,8.34552241090021,,0,0,0,8.34552241090021,4.995150817476967,,0,0,0,4.995150817476967,173.53803965538907,,0,0,0,173.53803965538907,61.11533493312243,,0,0,0,61.11533493312243,34.90258600727051,,0,0,0,34.90258600727051,119.42236597094572,,0,0,0,119.42236597094572
89,GLU,8.924951662087912,,0,0,0,8.924951662087912,4.696915147025197,,0,0,0,4.696915147025197,174.95155270289155,,0,0,0,174.95155270289155,54.26063108469309,,0,0,0,54.26063108469309,32.10519213353313,,0,0,0,32.10519213353313,127.60042310555001,,0,0,0,127.60042310555001