RESNUM,RESNAME,H_X,H_Y,H_BEST_REF_SCORE,H_BEST_REF_COV,H_BEST_REF_MATCH,H_UCBShift,HA_X,HA_Y,HA_BEST_REF_SCORE,HA_BEST_REF_COV,HA_BEST_REF_MATCH,HA_UCBShift,C_X,C_Y,C_BEST_REF_SCORE,C_BEST_REF_COV,C_BEST_REF_MATCH,C_UCBShift,CA_X,CA_Y,CA_BEST_REF_SCORE,CA_BEST_REF_COV,CA_BEST_REF_MATCH,CA_UCBShift,CB_X,CB_Y,CB_BEST_REF_SCORE,CB_BEST_REF_COV,CB_BEST_REF_MATCH,CB_UCBShift,N_X,N_Y,N_BEST_REF_SCORE,N_BEST_REF_COV,N_BEST_REF_MATCH,N_UCBShift
1,GLY,8.470957583022534,,0,0,0,8.470957583022534,3.9490449479853478,,0,0,0,3.9490449479853478,173.1770424568487,,0,0,0,173.1770424568487,44.94749486019536,,0,0,0,44.94749486019536,,,0,0,0,,109.9054625598124,,0,0,0,109.9054625598124
2,GLU,8.40379903069153,,0,0,0,8.40379903069153,4.336299916722166,,0,0,0,4.336299916722166,175.97742627865466,,0,0,0,175.97742627865466,56.53092862136752,,0,0,0,56.53092862136752,29.658048745110445,,0,0,0,29.658048745110445,121.76493793214564,,0,0,0,121.76493793214564
3,ASN,8.46440687077367,,0,0,0,8.46440687077367,4.676536292496393,,0,0,0,4.676536292496393,174.89043809140304,,0,0,0,174.89043809140304,53.04991694040959,,0,0,0,53.04991694040959,38.44287361647797,,0,0,0,38.44287361647797,122.40173556900878,,0,0,0,122.40173556900878
4,TYR,8.051831083116882,,0,0,0,8.051831083116882,4.11606828024753,,0,0,0,4.11606828024753,175.4554134133533,,0,0,0,175.4554134133533,58.37568541727162,,0,0,0,58.37568541727162,38.37369412852703,,0,0,0,38.37369412852703,123.39103538070817,,0,0,0,123.39103538070817
5,ASP,7.962913666466867,,0,0,0,7.962913666466867,4.652536516494616,,0,0,0,4.652536516494616,175.49198861751583,,0,0,0,175.49198861751583,54.17311606956377,,0,0,0,54.17311606956377,40.887709352170056,,0,0,0,40.887709352170056,123.73417630057166,,0,0,0,123.73417630057166
6,ASP,8.373202068131869,,0,0,0,8.373202068131869,4.853849843462094,,0,0,0,4.853849843462094,175.3894618197691,,0,0,0,175.3894618197691,52.30584220274171,,0,0,0,52.30584220274171,41.47597899508269,,0,0,0,41.47597899508269,125.1361438449828,,0,0,0,125.1361438449828
7,PRO,,,0,0,0,,4.421158052888778,,0,0,0,4.421158052888778,176.6459677564824,,0,0,0,176.6459677564824,64.25611451669997,,0,0,0,64.25611451669997,32.12601218647464,,0,0,0,32.12601218647464,,,0,0,0,
8,HIS,8.452855851276501,,0,0,0,8.452855851276501,4.709964636724386,,0,0,0,4.709964636724386,174.8143478432956,,0,0,0,174.8143478432956,55.74638195784771,,0,0,0,55.74638195784771,29.428091703235655,,0,0,0,29.428091703235655,115.90362245490066,,0,0,0,115.90362245490066
9,LYS,7.649263927378176,,0,0,0,7.649263927378176,4.552936102569652,,0,0,0,4.552936102569652,175.8578854665612,,0,0,0,175.8578854665612,55.413326725308025,,0,0,0,55.413326725308025,32.47070002393718,,0,0,0,32.47070002393718,121.33454487308248,,0,0,0,121.33454487308248
10,THR,8.193245217288268,,0,0,0,8.193245217288268,4.444489349916751,,0,0,0,4.444489349916751,172.83486237789432,,0,0,0,172.83486237789432,60.11347898319458,,0,0,0,60.11347898319458,69.93890534888999,,0,0,0,69.93890534888999,118.93491803916639,,0,0,0,118.93491803916639
11,PRO,,,0,0,0,,4.367317771539572,,0,0,0,4.367317771539572,176.04138293695195,,0,0,0,176.04138293695195,62.58658662316017,,0,0,0,62.58658662316017,32.0164435437396,,0,0,0,32.0164435437396,,,0,0,0,
12,ALA,7.9238228217060716,,0,0,0,7.9238228217060716,3.213880114119214,,0,0,0,3.213880114119214,176.91954335962927,,0,0,0,176.91954335962927,52.34754663289488,,0,0,0,52.34754663289488,18.49484970906871,,0,0,0,18.49484970906871,123.10993668570319,,0,0,0,123.10993668570319
13,SER,6.916177418442668,,0,0,0,6.916177418442668,5.01179642956488,,0,0,0,5.01179642956488,172.88127517049062,,0,0,0,172.88127517049062,54.91546855894661,,0,0,0,54.91546855894661,65.13270431647241,,0,0,0,65.13270431647241,116.50019604579309,,0,0,0,116.50019604579309
14,PRO,,,0,0,0,,4.60309784970585,,0,0,0,4.60309784970585,175.08591429081474,,0,0,0,175.08591429081474,64.32098018098013,,0,0,0,64.32098018098013,32.07757475899656,,0,0,0,32.07757475899656,,,0,0,0,
15,VAL,8.812452649822399,,0,0,0,8.812452649822399,5.066569964857364,,0,0,0,5.066569964857364,175.8126487388112,,0,0,0,175.8126487388112,61.602635725147074,,0,0,0,61.602635725147074,32.42420318613053,,0,0,0,32.42420318613053,119.59662348977689,,0,0,0,119.59662348977689
16,VAL,9.330553637007437,,0,0,0,9.330553637007437,5.283113850704851,,0,0,0,5.283113850704851,174.33674028480408,,0,0,0,174.33674028480408,58.953880013869465,,0,0,0,58.953880013869465,33.89248547785548,,0,0,0,33.89248547785548,123.01253382432013,,0,0,0,123.01253382432013
17,HIS,9.18184249044844,,0,0,0,9.18184249044844,5.398231083011433,,0,0,0,5.398231083011433,174.35208302329892,,0,0,0,174.35208302329892,54.19747045134865,,0,0,0,54.19747045134865,31.49191807794428,,0,0,0,31.49191807794428,124.03874082461427,,0,0,0,124.03874082461427
18,ILE,9.334075665884114,,0,0,0,9.334075665884114,5.140922867682318,,0,0,0,5.140922867682318,175.71676438958818,,0,0,0,175.71676438958818,58.47913454104229,,0,0,0,58.47913454104229,38.1966412529082,,0,0,0,38.1966412529082,126.99533602503053,,0,0,0,126.99533602503053
19,ARG,8.865280892535242,,0,0,0,8.865280892535242,5.143243792840494,,0,0,0,5.143243792840494,175.98073838906095,,0,0,0,175.98073838906095,54.30533367856588,,0,0,0,54.30533367856588,34.09525794174159,,0,0,0,34.09525794174159,125.63594507333222,,0,0,0,125.63594507333222
20,GLY,8.423069741403042,,0,0,0,8.423069741403042,4.058446919155844,,0,0,0,4.058446919155844,175.19414834357866,,0,0,0,175.19414834357866,45.99463107268287,,0,0,0,45.99463107268287,,,0,0,0,,108.96588124024863,,0,0,0,108.96588124024863
21,LEU,7.914174203801754,,0,0,0,7.914174203801754,4.24416403942724,,0,0,0,4.24416403942724,176.68006298594182,,0,0,0,176.68006298594182,55.069970185225884,,0,0,0,55.069970185225884,42.140962819225216,,0,0,0,42.140962819225216,120.54529223983239,,0,0,0,120.54529223983239
22,ILE,8.300821591419691,,0,0,0,8.300821591419691,4.275710278477079,,0,0,0,4.275710278477079,175.67079691973026,,0,0,0,175.67079691973026,60.27344757259962,,0,0,0,60.27344757259962,38.69376013443223,,0,0,0,38.69376013443223,117.53588472047397,,0,0,0,117.53588472047397
23,ASP,8.429522592046842,,0,0,0,8.429522592046842,4.4021396717338215,,0,0,0,4.4021396717338215,177.50662467793873,,0,0,0,177.50662467793873,55.60369052546898,,0,0,0,55.60369052546898,40.69999048931624,,0,0,0,40.69999048931624,122.1739778887002,,0,0,0,122.1739778887002
24,GLY,8.61307711966367,,0,0,0,8.61307711966367,3.9385971274392277,,0,0,0,3.9385971274392277,174.49992837878233,,0,0,0,174.49992837878233,45.05790414840715,,0,0,0,45.05790414840715,,,0,0,0,,110.13901395367965,,0,0,0,110.13901395367965
25,VAL,7.398323793084692,,0,0,0,7.398323793084692,3.924718263431013,,0,0,0,3.924718263431013,174.95506287227772,,0,0,0,174.95506287227772,63.51624718037518,,0,0,0,63.51624718037518,32.23006321252636,,0,0,0,32.23006321252636,121.25189422823843,,0,0,0,121.25189422823843
26,VAL,8.549746135991786,,0,0,0,8.549746135991786,4.4748501056443555,,0,0,0,4.4748501056443555,177.39743963601956,,0,0,0,177.39743963601956,60.35600884370074,,0,0,0,60.35600884370074,33.592301273681876,,0,0,0,33.592301273681876,122.01474544079255,,0,0,0,122.01474544079255
27,GLU,9.066908442640694,,0,0,0,9.066908442640694,3.7311029762543013,,0,0,0,3.7311029762543013,177.66702371561215,,0,0,0,177.66702371561215,60.20928664333999,,0,0,0,60.20928664333999,29.57966984198579,,0,0,0,29.57966984198579,122.50434256279277,,0,0,0,122.50434256279277
28,ALA,8.45312814955045,,0,0,0,8.45312814955045,4.052225372527473,,0,0,0,4.052225372527473,180.37125468573095,,0,0,0,180.37125468573095,54.915709496337,,0,0,0,54.915709496337,18.021848514446667,,0,0,0,18.021848514446667,119.3981656473249,,0,0,0,119.3981656473249
29,ASP,7.804614797796647,,0,0,0,7.804614797796647,4.547353366650016,,0,0,0,4.547353366650016,178.8557326253691,,0,0,0,178.8557326253691,57.08237759141969,,0,0,0,57.08237759141969,40.6452176481796,,0,0,0,40.6452176481796,117.84623791503498,,0,0,0,117.84623791503498
30,LEU,7.956802762803863,,0,0,0,7.956802762803863,4.012084400643801,,0,0,0,4.012084400643801,179.0020474987235,,0,0,0,179.0020474987235,57.5932832481352,,0,0,0,57.5932832481352,41.835708196087246,,0,0,0,41.835708196087246,120.22952929645909,,0,0,0,120.22952929645909
31,VAL,8.543158824131423,,0,0,0,8.543158824131423,3.4674706162642903,,0,0,0,3.4674706162642903,178.10756352057388,,0,0,0,178.10756352057388,66.93068815427905,,0,0,0,66.93068815427905,31.677871254745256,,0,0,0,31.677871254745256,118.95060180895771,,0,0,0,118.95060180895771
32,GLU,8.314419774852924,,0,0,0,8.314419774852924,4.026111903496504,,0,0,0,4.026111903496504,178.85346294830725,,0,0,0,178.85346294830725,59.505275204134755,,0,0,0,59.505275204134755,29.585839724475523,,0,0,0,29.585839724475523,120.19048901376956,,0,0,0,120.19048901376956
33,ALA,7.856022785980686,,0,0,0,7.856022785980686,4.230862810769786,,0,0,0,4.230862810769786,179.0171328418637,,0,0,0,179.0171328418637,54.26479745876346,,0,0,0,54.26479745876346,19.183730553185704,,0,0,0,19.183730553185704,121.3146944054723,,0,0,0,121.3146944054723
34,LEU,7.918255084415584,,0,0,0,7.918255084415584,4.506039009587635,,0,0,0,4.506039009587635,178.61222348142414,,0,0,0,178.61222348142414,55.95226792957043,,0,0,0,55.95226792957043,42.71696941976357,,0,0,0,42.71696941976357,114.80483422668442,,0,0,0,114.80483422668442
35,GLN,8.45141874101454,,0,0,0,8.45141874101454,4.420348927775002,,0,0,0,4.420348927775002,178.08256785483405,,0,0,0,178.08256785483405,58.199742423337774,,0,0,0,58.199742423337774,27.70665437187812,,0,0,0,27.70665437187812,120.97390118066377,,0,0,0,120.97390118066377
36,GLU,9.087659375824176,,0,0,0,9.087659375824176,4.039349490512265,,0,0,0,4.039349490512265,177.21497595231435,,0,0,0,177.21497595231435,58.15146748001998,,0,0,0,58.15146748001998,28.645075760545012,,0,0,0,28.645075760545012,119.24364213005329,,0,0,0,119.24364213005329
37,PHE,7.696069753696304,,0,0,0,7.696069753696304,4.501650084398934,,0,0,0,4.501650084398934,175.91109208498725,,0,0,0,175.91109208498725,58.40652790351316,,0,0,0,58.40652790351316,39.62287690067155,,0,0,0,39.62287690067155,117.99521046835386,,0,0,0,117.99521046835386
38,GLY,7.448741530808082,,0,0,0,7.448741530808082,4.196889678071928,,0,0,0,4.196889678071928,171.77316167076256,,0,0,0,171.77316167076256,44.59470947052947,,0,0,0,44.59470947052947,,,0,0,0,,106.23522317004107,,0,0,0,106.23522317004107
39,PRO,,,0,0,0,,4.435311062162837,,0,0,0,4.435311062162837,176.0560104856699,,0,0,0,176.0560104856699,63.305077373981575,,0,0,0,63.305077373981575,31.880055791935842,,0,0,0,31.880055791935842,,,0,0,0,
40,ILE,8.572566612881563,,0,0,0,8.572566612881563,4.040086480405706,,0,0,0,4.040086480405706,175.99518063470973,,0,0,0,175.99518063470973,61.43800782071817,,0,0,0,61.43800782071817,38.64476945260295,,0,0,0,38.64476945260295,123.4150991865801,,0,0,0,123.4150991865801
41,SER,9.063080625846377,,0,0,0,9.063080625846377,4.516469784398934,,0,0,0,4.516469784398934,174.72981394371737,,0,0,0,174.72981394371737,59.47504837421467,,0,0,0,59.47504837421467,64.28461413515373,,0,0,0,64.28461413515373,123.69358197646797,,0,0,0,123.69358197646797
42,TYR,8.091603032828282,,0,0,0,8.091603032828282,4.865123795621046,,0,0,0,4.865123795621046,173.33661915458987,,0,0,0,173.33661915458987,58.32754762425907,,0,0,0,58.32754762425907,42.118953255366854,,0,0,0,42.118953255366854,118.36628720667665,,0,0,0,118.36628720667665
43,VAL,7.692742626773226,,0,0,0,7.692742626773226,4.705395195632145,,0,0,0,4.705395195632145,174.28191521170498,,0,0,0,174.28191521170498,60.51352565564991,,0,0,0,60.51352565564991,35.1297225985126,,0,0,0,35.1297225985126,124.43396732741704,,0,0,0,124.43396732741704
44,VAL,9.10235954991675,,0,0,0,9.10235954991675,4.3781795125596625,,0,0,0,4.3781795125596625,174.52467975643802,,0,0,0,174.52467975643802,61.02820295844156,,0,0,0,61.02820295844156,35.023876295182596,,0,0,0,35.023876295182596,127.67822854321234,,0,0,0,127.67822854321234
45,VAL,8.785224465540015,,0,0,0,8.785224465540015,4.188560559623709,,0,0,0,4.188560559623709,175.340609895116,,0,0,0,175.340609895116,62.224312962382065,,0,0,0,62.224312962382065,32.56515312485293,,0,0,0,32.56515312485293,127.40418108014764,,0,0,0,127.40418108014764
46,MET,9.0871405506882,,0,0,0,9.0871405506882,5.168912843933844,,0,0,0,5.168912843933844,175.28190339223,,0,0,0,175.28190339223,52.268233498018645,,0,0,0,52.268233498018645,32.864757355244755,,0,0,0,32.864757355244755,127.82819042066822,,0,0,0,127.82819042066822
47,PRO,,,0,0,0,,4.247678961646686,,0,0,0,4.247678961646686,179.15465283349985,,0,0,0,179.15465283349985,65.57323169214119,,0,0,0,65.57323169214119,31.667724122505273,,0,0,0,31.667724122505273,,,0,0,0,
48,LYS,8.418789913813963,,0,0,0,8.418789913813963,4.259474137523587,,0,0,0,4.259474137523587,177.52011656975802,,0,0,0,177.52011656975802,57.987514341785996,,0,0,0,57.987514341785996,32.10682900284716,,0,0,0,32.10682900284716,118.22743434277945,,0,0,0,118.22743434277945
49,LYS,7.79591716111111,,0,0,0,7.79591716111111,4.458984844305695,,0,0,0,4.458984844305695,175.63579203782882,,0,0,0,175.63579203782882,56.04607138902209,,0,0,0,56.04607138902209,33.25680271536242,,0,0,0,33.25680271536242,117.59273529885671,,0,0,0,117.59273529885671
50,ARG,7.824793275668776,,0,0,0,7.824793275668776,3.752614436394161,,0,0,0,3.752614436394161,174.97917823958264,,0,0,0,174.97917823958264,57.53395428564213,,0,0,0,57.53395428564213,27.066063354617604,,0,0,0,27.066063354617604,118.44985515552226,,0,0,0,118.44985515552226
51,GLN,7.848495377672328,,0,0,0,7.848495377672328,5.392583564874015,,0,0,0,5.392583564874015,174.21444561839826,,0,0,0,174.21444561839826,54.393620670451774,,0,0,0,54.393620670451774,34.226853670279716,,0,0,0,34.226853670279716,113.7343600030303,,0,0,0,113.7343600030303
52,ALA,9.11704833901099,,0,0,0,9.11704833901099,5.443264487051838,,0,0,0,5.443264487051838,175.45601666975801,,0,0,0,175.45601666975801,50.71958576588412,,0,0,0,50.71958576588412,23.40064681865357,,0,0,0,23.40064681865357,121.24922468550893,,0,0,0,121.24922468550893
53,LEU,8.932159054767457,,0,0,0,8.932159054767457,5.361592175735376,,0,0,0,5.361592175735376,175.4995794604229,,0,0,0,175.4995794604229,53.51808138621379,,0,0,0,53.51808138621379,44.58575092060162,,0,0,0,44.58575092060162,121.3216844488012,,0,0,0,121.3216844488012
54,VAL,9.177298296964144,,0,0,0,9.177298296964144,4.527809393589743,,0,0,0,4.527809393589743,173.84969250359086,,0,0,0,173.84969250359086,60.91565235357976,,0,0,0,60.91565235357976,34.677949989521586,,0,0,0,34.677949989521586,123.38384422630703,,0,0,0,123.38384422630703
55,GLU,8.848478258929958,,0,0,0,8.848478258929958,5.118720753196803,,0,0,0,5.118720753196803,176.0716079154734,,0,0,0,176.0716079154734,54.051257860539465,,0,0,0,54.051257860539465,31.562798894522142,,0,0,0,31.562798894522142,127.97073781696636,,0,0,0,127.97073781696636
56,PHE,9.353292752047953,,0,0,0,9.353292752047953,4.915888321156621,,0,0,0,4.915888321156621,175.90577077773892,,0,0,0,175.90577077773892,59.093056755588854,,0,0,0,59.093056755588854,40.71918675778666,,0,0,0,40.71918675778666,127.72359695649907,,0,0,0,127.72359695649907
57,GLU,9.229444185503386,,0,0,0,9.229444185503386,4.150570761013986,,0,0,0,4.150570761013986,176.181311658658,,0,0,0,176.181311658658,58.50766324221334,,0,0,0,58.50766324221334,30.339767294155845,,0,0,0,30.339767294155845,120.54704974257965,,0,0,0,120.54704974257965
58,ASP,8.04510002934843,,0,0,0,8.04510002934843,4.8653501913641914,,0,0,0,4.8653501913641914,177.21013725204241,,0,0,0,177.21013725204241,53.15563130590521,,0,0,0,53.15563130590521,43.1522746497558,,0,0,0,43.1522746497558,116.92472186535687,,0,0,0,116.92472186535687
59,VAL,8.687975610472861,,0,0,0,8.687975610472861,3.8764545532967034,,0,0,0,3.8764545532967034,177.71208153065825,,0,0,0,177.71208153065825,65.03837727040738,,0,0,0,65.03837727040738,31.95826597055722,,0,0,0,31.95826597055722,121.51218775819181,,0,0,0,121.51218775819181
60,LEU,8.54387618031968,,0,0,0,8.54387618031968,4.099969272222222,,0,0,0,4.099969272222222,178.80388584603173,,0,0,0,178.80388584603173,57.24659705284716,,0,0,0,57.24659705284716,41.634534187351534,,0,0,0,41.634534187351534,122.89653236091685,,0,0,0,122.89653236091685
61,GLY,8.08469087998668,,0,0,0,8.08469087998668,3.4025132889027656,,0,0,0,3.4025132889027656,175.60805507698413,,0,0,0,175.60805507698413,46.80341588636919,,0,0,0,46.80341588636919,,,0,0,0,,107.35816299596515,,0,0,0,107.35816299596515
62,ALA,7.3272553068709065,,0,0,0,7.3272553068709065,3.540908193312244,,0,0,0,3.540908193312244,179.3926970250139,,0,0,0,179.3926970250139,55.180928097552446,,0,0,0,55.180928097552446,18.34658758586969,,0,0,0,18.34658758586969,124.0221261519314,,0,0,0,124.0221261519314
63,CYS,8.680163630663781,,0,0,0,8.680163630663781,4.424142839219114,,0,0,0,4.424142839219114,176.8584232680375,,0,0,0,176.8584232680375,62.0409976034743,,0,0,0,62.0409976034743,26.70205110917416,,0,0,0,26.70205110917416,118.57927212252191,,0,0,0,118.57927212252191
64,ASN,8.327861556920857,,0,0,0,8.327861556920857,4.433072012257187,,0,0,0,4.433072012257187,177.52013243248416,,0,0,0,177.52013243248416,55.862875877167276,,0,0,0,55.862875877167276,37.75064667131757,,0,0,0,37.75064667131757,119.64872436500167,,0,0,0,119.64872436500167
65,ALA,8.043476302342103,,0,0,0,8.043476302342103,2.955744781354756,,0,0,0,2.955744781354756,179.09715758936065,,0,0,0,179.09715758936065,54.64365342065157,,0,0,0,54.64365342065157,18.147466110284164,,0,0,0,18.147466110284164,123.9013815452381,,0,0,0,123.9013815452381
66,VAL,8.398183653735153,,0,0,0,8.398183653735153,3.299587915015541,,0,0,0,3.299587915015541,178.6444437036186,,0,0,0,178.6444437036186,66.60276296968587,,0,0,0,66.60276296968587,31.392180081929183,,0,0,0,31.392180081929183,118.50193975432346,,0,0,0,118.50193975432346
67,ASN,8.320446041519592,,0,0,0,8.320446041519592,4.382331105894107,,0,0,0,4.382331105894107,177.73095736253745,,0,0,0,177.73095736253745,55.221356394405596,,0,0,0,55.221356394405596,38.06073007596848,,0,0,0,38.06073007596848,117.97502484008214,,0,0,0,117.97502484008214
68,TYR,8.201433569602619,,0,0,0,8.201433569602619,4.1364206622988124,,0,0,0,4.1364206622988124,177.51892720729825,,0,0,0,177.51892720729825,61.49660037044622,,0,0,0,61.49660037044622,38.73072336704961,,0,0,0,38.73072336704961,122.21048836148296,,0,0,0,122.21048836148296
69,ALA,8.126710865118214,,0,0,0,8.126710865118214,4.418695532256632,,0,0,0,4.418695532256632,178.96992388079698,,0,0,0,178.96992388079698,53.816143873615275,,0,0,0,53.816143873615275,18.299226893051394,,0,0,0,18.299226893051394,121.1861600537851,,0,0,0,121.1861600537851
70,ALA,7.684293276356977,,0,0,0,7.684293276356977,4.156046432897658,,0,0,0,4.156046432897658,179.00052311928073,,0,0,0,179.00052311928073,54.33603472422023,,0,0,0,54.33603472422023,18.47146620632146,,0,0,0,18.47146620632146,119.69075979928405,,0,0,0,119.69075979928405
71,ASP,7.755747221567321,,0,0,0,7.755747221567321,4.607823402031302,,0,0,0,4.607823402031302,176.29061651776559,,0,0,0,176.29061651776559,55.247918224897326,,0,0,0,55.247918224897326,42.370393944894,,0,0,0,42.370393944894,116.00893888389389,,0,0,0,116.00893888389389
72,ASN,7.921506942601844,,0,0,0,7.921506942601844,4.700095280663781,,0,0,0,4.700095280663781,175.0281945126873,,0,0,0,175.0281945126873,52.669451274081474,,0,0,0,52.669451274081474,40.12028135898546,,0,0,0,40.12028135898546,118.31322161812632,,0,0,0,118.31322161812632
73,GLN,8.353871857292708,,0,0,0,8.353871857292708,4.263683083366633,,0,0,0,4.263683083366633,175.1177461444056,,0,0,0,175.1177461444056,55.24344755761461,,0,0,0,55.24344755761461,29.39678283055278,,0,0,0,29.39678283055278,121.09994862292707,,0,0,0,121.09994862292707
74,ILE,8.273207272660672,,0,0,0,8.273207272660672,4.489191140567765,,0,0,0,4.489191140567765,174.53222575886335,,0,0,0,174.53222575886335,60.55912020886336,,0,0,0,60.55912020886336,40.07783785377955,,0,0,0,40.07783785377955,124.88547713912754,,0,0,0,124.88547713912754
75,TYR,8.541235148812298,,0,0,0,8.541235148812298,5.204746070579421,,0,0,0,5.204746070579421,175.16142528143524,,0,0,0,175.16142528143524,56.747173867488065,,0,0,0,56.747173867488065,39.956812857337106,,0,0,0,39.956812857337106,127.01359738846709,,0,0,0,127.01359738846709
76,ILE,9.045203045987346,,0,0,0,9.045203045987346,4.42684546918082,,0,0,0,4.42684546918082,175.81590438488178,,0,0,0,175.81590438488178,59.047247657320455,,0,0,0,59.047247657320455,39.67960915843601,,0,0,0,39.67960915843601,123.72118468680765,,0,0,0,123.72118468680765
77,ALA,9.226642711988013,,0,0,0,9.226642711988013,3.9882627776390276,,0,0,0,3.9882627776390276,177.66886581387502,,0,0,0,177.66886581387502,53.24030283936619,,0,0,0,53.24030283936619,17.32109066429682,,0,0,0,17.32109066429682,131.8732296042846,,0,0,0,131.8732296042846
78,GLY,8.53512208044733,,0,0,0,8.53512208044733,3.8633768810356304,,0,0,0,3.8633768810356304,173.56652052199468,,0,0,0,173.56652052199468,45.84475698800089,,0,0,0,45.84475698800089,,,0,0,0,,103.17968553695749,,0,0,0,103.17968553695749
79,HIS,8.123286959002108,,0,0,0,8.123286959002108,5.495642481901432,,0,0,0,5.495642481901432,172.88468334191919,,0,0,0,172.88468334191919,53.52061421233211,,0,0,0,53.52061421233211,30.93224222952048,,0,0,0,30.93224222952048,119.4510731499334,,0,0,0,119.4510731499334
80,PRO,,,0,0,0,,4.28651875018315,,0,0,0,4.28651875018315,176.04794971715506,,0,0,0,176.04794971715506,62.5765300485237,,0,0,0,62.5765300485237,31.93733394618715,,0,0,0,31.93733394618715,,,0,0,0,
81,ALA,8.5581179000666,,0,0,0,8.5581179000666,4.718633511410811,,0,0,0,4.718633511410811,175.6569553479687,,0,0,0,175.6569553479687,50.678464672422024,,0,0,0,50.678464672422024,22.54559520814186,,0,0,0,22.54559520814186,126.35697022693972,,0,0,0,126.35697022693972
82,PHE,9.086478520801421,,0,0,0,9.086478520801421,4.82979439074814,,0,0,0,4.82979439074814,175.22310566610614,,0,0,0,175.22310566610614,56.65194500954046,,0,0,0,56.65194500954046,40.8505315515984,,0,0,0,40.8505315515984,119.97125538418248,,0,0,0,119.97125538418248
83,VAL,8.778710885581084,,0,0,0,8.778710885581084,4.788383992579643,,0,0,0,4.788383992579643,174.39168905621045,,0,0,0,174.39168905621045,60.91004503554779,,0,0,0,60.91004503554779,33.971501481546234,,0,0,0,33.971501481546234,123.61582664018759,,0,0,0,123.61582664018759
84,ASN,8.630243191341991,,0,0,0,8.630243191341991,4.843788143123543,,0,0,0,4.843788143123543,174.14372199030967,,0,0,0,174.14372199030967,51.598046605239205,,0,0,0,51.598046605239205,42.75072774417804,,0,0,0,42.75072774417804,122.68623126287046,,0,0,0,122.68623126287046
85,TYR,8.664798615268065,,0,0,0,8.664798615268065,5.033443821578421,,0,0,0,5.033443821578421,176.80075001417472,,0,0,0,176.80075001417472,59.27575690431235,,0,0,0,59.27575690431235,39.0018067052503,,0,0,0,39.0018067052503,119.60880406284271,,0,0,0,119.60880406284271
86,SER,8.919573205611057,,0,0,0,8.919573205611057,4.650436278715729,,0,0,0,4.650436278715729,175.54955437396492,,0,0,0,175.54955437396492,58.046032354467755,,0,0,0,58.046032354467755,65.32745057409257,,0,0,0,65.32745057409257,116.96001586636142,,0,0,0,116.96001586636142
87,THR,8.488096433793984,,0,0,0,8.488096433793984,4.325361631052281,,0,0,0,4.325361631052281,174.9842193482351,,0,0,0,174.9842193482351,62.69369767538017,,0,0,0,62.69369767538017,69.26746488976023,,0,0,0,69.26746488976023,116.09271074059274,,0,0,0,116.09271074059274
88,SER,8.374552288550339,,0,0,0,8.374552288550339,4.6028951177489175,,0,0,0,4.6028951177489175,174.87159593449329,,0,0,0,174.87159593449329,57.90181058178488,,0,0,0,57.90181058178488,64.79533525713731,,0,0,0,64.79533525713731,118.410829199445,,0,0,0,118.410829199445
89,GLN,8.689716734065934,,0,0,0,8.689716734065934,4.489321898296148,,0,0,0,4.489321898296148,175.41881549852368,,0,0,0,175.41881549852368,56.932624733144635,,0,0,0,56.932624733144635,29.92052586003441,,0,0,0,29.92052586003441,120.76676547047951,,0,0,0,120.76676547047951
90,LYS,7.7263581892718385,,0,0,0,7.7263581892718385,4.46416635041625,,0,0,0,4.46416635041625,174.89769342224997,,0,0,0,174.89769342224997,55.14673816140527,,0,0,0,55.14673816140527,35.1972315922189,,0,0,0,35.1972315922189,116.87266048900544,,0,0,0,116.87266048900544